{"text_format":"1","workbook":"xlsx","n_sheets":9,"sheets":["Algemene Inleiding","Algemene gegevens","A","B","C","D","BCD-inregeling","Afpuntlijsten","Data"],"not_rendered":{"charts":0,"images":13,"macros":1,"external_links":0,"defined_names":19,"comments":1,"pivot_tables":0},"unopened":[],"bounds":{"document_bytes":16777216,"sheet_cells":100000,"rows_first":2000,"rows_last":500,"rows_between":2000,"halvings":0,"cell_chars":16384,"cell_head_chars":4096},"cells_cut":0,"cells_raw":0,"read":"whole","date_system":"1900"}

{"sheet":"Algemene Inleiding","index":0,"n_rows":24,"n_cols":3,"rows_kept":24,"cut":false,"hidden":false,"merged":[]}
[]
[null,"VENTILATIEGIDS - REKENBLAD"]
[null,"Conventies in het rekenblad"]
[null,"De nodige invoer voor de berekening, vereist het invullen of aanpassen van de groene en gele vakjes."]
[]
[null,"De nodige invoer voor de berekening, vereist het invullen of aanpassen van de groene en gele vakjes."]
[null,null,"In de groene vakjes kunnen tekst (bv. een naam) of getallen (bv. een debiet, ...) worden ingevuld."]
[null,null,"In de gele cellen kan een keuze uit een afrollijst worden gemaakt. Deze keuzelijst wordt zichtbaar door op de desbetreffende cel te klikken."]
[null,"Het is zeer belangrijk dat de gebruiker niets verandert in de andere cellen."]
[]
{"$rows_left_out":15}
{"sheet":"Algemene gegevens","index":1,"n_rows":37,"n_cols":15,"rows_kept":37,"cut":false,"hidden":false,"merged":[[8,9,9,9],[6,6,6,14],[7,12,7,14],[8,12,8,13],[7,6,7,9],[8,14,9,14],[7,10,7,11],[8,10,9,10],[8,11,9,11],[8,6,8,7],[8,8,9,8]]}
[]
[null,null,"Berekeningsblad VENTILATIE"]
[]
[null,null,"Algemene gegevens"]
[]
[]
[null,null,null,null,null,null,"Debiet"]
[null,null,null,null,null,null,"Toevoer",null,null,null,"Doorvoer",null,"Afvoer"]
[null,null,null,null,null,null,"Ontwerpdebiet",null,"mag beperkt worden tot","vrije toevoer maximum (A/C)","minimaal (afvoer uit ruimte)","minimaal (toevoer naar ruimte)","Ontwerpdebiet",null,"mag beperkt worden tot"]
[null,null,"Naam","Code","Soort ruimte","Opp","algemene regel","minimaal",null,null,null,null,"algemene regel","minimaal"]
{"$rows_left_out":28}
{"sheet":"A","index":2,"n_rows":51,"n_cols":38,"rows_kept":51,"cut":false,"hidden":false,"merged":[[9,20,9,24],[3,4,3,8],[10,13,10,14],[10,10,10,12],[9,6,9,14],[10,6,10,9]]}
[]
[null,null,"Berekeningsblad VENTILATIE"]
[null,null,null,null,null,null,null,null,null,null,null,null,null,null,null,null,null,null,null,null,null,null,null,null,null,null,null,null,null,null,"hulptabel"]
[null,null,"Ventilatiesysteem",null,"A: natuurlijke toevoer, natuurlijke afvoer ",null,null,null,null,null,null,null,null,null,null,null,null,null,null,null,null,null,null,null,null,null,null,null,null,null,{"$f":"LOOKUP(E4,ventilatiesysteem,Data!B5:B8)","v":"A"},{"$f":"LOOKUP(E4,ventilatiesysteem,Data!C5:C8)","v":1}]
[]
[null,null,"SPECIFICATIEBLAD",null,null,null,null,null,null,null,null,null,null,null,null,null,null,null,"PRODUCTKEUZE",null,null,null,null,null,null,null,null,null,null,null,{"$f":"+O50","v":1.5}]
[]
[]
[]
[null,null,null,null,null,null,"Debiet",null,null,null,null,null,null,null,null,null,null,null,null,null,"Toevoer",null,null,null,null,"Doorstroom","Afvoer"]
{"$rows_left_out":42}
{"sheet":"B","index":3,"n_rows":71,"n_cols":37,"rows_kept":71,"cut":false,"hidden":false,"merged":[[70,19,70,20],[66,19,66,20],[67,19,67,20],[68,19,68,20],[69,19,69,20],[61,19,61,20],[64,19,64,20],[65,19,65,20],[3,4,3,8],[60,4,60,5],[10,6,10,8],[10,12,10,13],[9,6,9,13],[10,9,10,11]]}
[]
[null,null,"Berekeningsblad VENTILATIE"]
[null,null,null,null,null,null,null,null,null,null,null,null,null,null,null,null,null,null,null,null,null,null,null,null,null,null,null,null,null,"hulptabel"]
[null,null,"Ventilatiesysteem",null,"B: mechanische toevoer, vrije afvoer",null,null,null,null,null,null,null,null,null,null,null,null,null,null,null,null,null,null,null,null,null,null,null,null,{"$f":"LOOKUP(E4,ventilatiesysteem,Data!B5:B8)","v":"B"},{"$f":"LOOKUP(E4,ventilatiesysteem,Data!C5:C8)","v":2}]
[]
[null,null,"SPECIFICATIEBLAD",null,null,null,null,null,null,null,null,null,null,null,null,null,null,null,null,"PRODUCTKEUZE",null,null,null,null,null,null,null,null,null,{"$f":"+N56","v":1.5}]
[]
[]
[null,null,null,null,null,null,null,"debietsmeting ?","ja",null,null,null,null,null,null,null,null,null,null,null,null,null,null,null,null,null,null,null,{"$f":"IF(OR(AE4=1,AE4=3,I9=\"nee\"),\"zwart\",\"niet zwart\")","v":"niet zwart"}]
[null,null,null,null,null,null,"Debiet"]
{"$rows_left_out":62}
{"sheet":"C","index":4,"n_rows":65,"n_cols":40,"rows_kept":65,"cut":false,"hidden":false,"merged":[[63,19,63,20],[64,19,64,20],[55,19,55,20],[58,19,58,20],[59,19,59,20],[60,19,60,20],[61,19,61,20],[62,19,62,20],[9,21,9,25],[54,4,54,5],[3,4,3,8],[10,6,10,9],[10,13,10,15],[9,6,9,15],[10,10,10,12]]}
[]
[null,null,"Berekeningsblad VENTILATIE"]
[null,null,null,null,null,null,null,null,null,null,null,null,null,null,null,null,null,null,null,null,null,null,null,null,null,null,null,null,null,null,null,null,null,null,null,"hulptabel"]
[null,null,"Ventilatiesysteem",null,"C: vrije toevoer, mechanische afvoer",null,null,null,null,null,null,null,null,null,null,null,null,null,null,null,null,null,null,null,null,null,null,null,null,null,null,null,null,null,null,{"$f":"LOOKUP(E4,ventilatiesysteem,Data!B5:B8)","v":"C"},{"$f":"LOOKUP(E4,ventilatiesysteem,Data!C5:C8)","v":3}]
[]
[null,null,"SPECIFICATIEBLAD",null,null,null,null,null,null,null,null,null,null,null,null,null,null,null,null,"PRODUCTKEUZE",null,null,null,null,null,null,null,null,null,null,null,null,null,null,null,{"$f":"+P50","v":1.5}]
[]
[]
[null,null,null,null,null,null,null,null,null,null,null,null,null,null,"debietsmeting?","ja",null,null,null,null,null,null,null,null,null,null,null,null,null,null,null,null,null,null,null,{"$f":"IF(OR(AK4=1,P9=\"nee\"),\"zwart\",\"niet zwart\")","v":"niet zwart"}]
[null,null,null,null,null,null,"Debiet",null,null,null,null,null,null,null,null,null,null,null,null,null,null,"Toevoer",null,null,null,null,"Doorstroom"]
{"$rows_left_out":56}
{"sheet":"D","index":5,"n_rows":83,"n_cols":45,"rows_kept":83,"cut":false,"hidden":false,"merged":[[77,20,77,21],[82,20,82,21],[81,20,81,21],[80,20,80,21],[79,20,79,21],[72,4,72,5],[61,21,61,24],[78,20,78,21],[73,22,73,24],[73,20,73,21],[76,20,76,21],[9,6,9,15],[10,10,10,12],[3,4,3,9],[68,6,68,9],[35,10,36,12],[10,6,10,9],[10,13,10,15]]}
[]
[null,null,"Berekeningsblad VENTILATIE"]
[null,null,null,null,null,null,null,null,null,null,null,null,null,null,null,null,null,null,null,null,null,null,null,null,null,null,null,null,null,null,null,null,"hulptabel"]
[null,null,"Ventilatiesysteem",null,"D: mechanische toevoer, mechanische afvoer ",null,null,null,null,null,null,null,null,null,null,null,null,null,null,null,null,null,null,null,null,null,null,null,null,null,null,null,{"$f":"LOOKUP(E4,ventilatiesysteem,Data!B5:B8)","v":"D"},null,{"$f":"LOOKUP(E4,ventilatiesysteem,Data!C5:C8)","v":4}]
[]
[null,null,"SPECIFICATIEBLAD",null,null,null,null,null,null,null,null,null,null,null,null,null,null,null,null,null,"PRODUCTKEUZE",null,null,null,null,null,null,null,null,null,null,null,{"$f":"+P56","v":1.5}]
[]
[]
[null,null,null,null,null,null,"Recirculatie?","ja",null,"ja","debietsmeting?",null,null,null,"debietsmeting?","ja",null,null,null,null,null,null,null,null,null,null,null,null,null,null,null,null,{"$f":"IF(OR(AI4=1,AI4=3,P9=\"nee\"),\"zwart\",\"niet zwart\")","v":"niet zwart"}]
[null,null,null,null,null,null,"Debiet"]
{"$rows_left_out":74}
{"sheet":"BCD-inregeling","index":6,"n_rows":39,"n_cols":24,"rows_kept":39,"cut":false,"hidden":false,"merged":[[11,12,11,15],[11,16,11,19],[11,20,11,23],[3,4,3,7],[10,6,10,15],[11,6,11,7],[11,8,11,11]]}
[]
[null,null,"Inregeling van debieten"]
[]
[null,null,"Ventilatiesysteem",null,"D: mechanische toevoer, mechanische afvoer "]
[]
[null,null,"Werkwijze"]
[]
[null,null,"recirculatie afzonderlijk eerst doen"]
[]
[]
{"$rows_left_out":30}
{"sheet":"Afpuntlijsten","index":7,"n_rows":101,"n_cols":9,"rows_kept":101,"cut":false,"hidden":false,"merged":[]}
[]
[null,"AFPUNTLIJSTEN "]
[]
[null,"OPLEVERING",null,null,null,"A","B","C","D"]
[]
[null,null,"Instellingen en metingen"]
[null,null,"instellen van de ventilatorstanden",null,null,null,"x","x","x"]
[null,null,"instellen klokregeling, aanwezigheidssturing,…",null,null,null,"(x)","(x)","(x)"]
[null,null,"instellen en meten van de toevoerdebieten",null,null,null,"x",null,"x"]
[null,null,"instellen en meten van de afvoerdebieten",null,null,null,null,"x","x"]
{"$rows_left_out":92}
{"sheet":"Data","index":8,"n_rows":82,"n_cols":9,"rows_kept":82,"cut":false,"hidden":false,"merged":[]}
[]
["Dit tabblad bevat gegevens ter ondersteuning van de programmatie die niet gewijzigd mogen worden!!"]
[]
["ventilatiesysteem"]
["A: natuurlijke toevoer, natuurlijke afvoer ","A",1]
["B: mechanische toevoer, vrije afvoer","B",2]
["C: vrije toevoer, mechanische afvoer","C",3]
["D: mechanische toevoer, mechanische afvoer ","D",4]
[null,"algemeen","min","beperking"]
["type","Talg","Tmin","Tbeperk","Dmin","Luchttype"]
{"$rows_left_out":72}