{"text_format":"1","workbook":"xlsx","n_sheets":9,"sheets":["Algemene Inleiding","Algemene gegevens","A","B","C","D","BCD-inregeling","Afpuntlijsten","Data"],"not_rendered":{"charts":0,"images":13,"macros":1,"external_links":0,"defined_names":19,"comments":1,"pivot_tables":0},"unopened":[],"bounds":{"document_bytes":16777216,"sheet_cells":100000,"rows_first":2000,"rows_last":500,"rows_between":2000,"halvings":0,"cell_chars":16384,"cell_head_chars":4096},"cells_cut":0,"cells_raw":0,"read":"whole","date_system":"1900"}

{"sheet":"Algemene Inleiding","index":0,"n_rows":24,"n_cols":3,"rows_kept":24,"cut":false,"hidden":false,"merged":[]}
[]
[null,"VENTILATIEGIDS - REKENBLAD"]
[null,"Conventies in het rekenblad"]
[null,"De nodige invoer voor de berekening, vereist het invullen of aanpassen van de groene en gele vakjes."]
[]
[null,"De nodige invoer voor de berekening, vereist het invullen of aanpassen van de groene en gele vakjes."]
[null,null,"In de groene vakjes kunnen tekst (bv. een naam) of getallen (bv. een debiet, ...) worden ingevuld."]
[null,null,"In de gele cellen kan een keuze uit een afrollijst worden gemaakt. Deze keuzelijst wordt zichtbaar door op de desbetreffende cel te klikken."]
[null,"Het is zeer belangrijk dat de gebruiker niets verandert in de andere cellen."]
[]
[null,"Andere types van cellen die kunnen voorkomen (en waarvan de inhoud niet mag veranderd worden!)"]
[null,null,"De blauwe vakjes bevatten tussenresultaten."]
[null,null,"Zwarte cellen bevatten informatie die irrelevant en dus ongebruikt is voor de gekozen configuratie."]
[null,null,"Afhankelijk van de waarden in andere cellen, kunnen zwarte cellen terug zichtbaar worden, zodat er bijvoorbeeld iets kan ingevuld worden, of een keuze kan gemaakt worden."]
[null,null,"Andersom, kan het zijn dat bepaalde cellen zwart worden door een bepaalde keuze die ergens anders wordt gemaakt."]
[null,null,"De rode cellen geven het eindresultaat dat moet ingevoerd worden in de EPB-software."]
[null,null,"Licht paarse cellen duiden op wettelijk niet in orde resultaten"]
[null,null,"Paarse cellen geven niet-conforme of niet-optimale gegevens of resultaten aan (bv. te lage debieten), die echter niet steeds een effect hebben op de m-factor."]
[null,null,"verplicht in te vullen velden, waar nog geen waarde is ingevuld, kunnen ook paars worden"]
[null,null,"De overblijvende cellen zijn wit en bevatten titels, resultaten of beschrijvingen."]
[null,"Het werkblad 'Data' heeft geen enkel relevantie voor de gebruiker, en dient als hulpmiddel voor de schrijver van het XL-bestand."]
[]
[null,"Het werkblad bevat macro's"]
[null,"Voor een goede werking dient de macro beveiliging op 'medium' te worden ingesteld en het document moet opnieuw geladen worden."]

{"sheet":"Algemene gegevens","index":1,"n_rows":37,"n_cols":15,"rows_kept":37,"cut":false,"hidden":false,"merged":[[8,9,9,9],[6,6,6,14],[7,12,7,14],[8,12,8,13],[7,6,7,9],[8,14,9,14],[7,10,7,11],[8,10,9,10],[8,11,9,11],[8,6,8,7],[8,8,9,8]]}
[]
[null,null,"Berekeningsblad VENTILATIE"]
[]
[null,null,"Algemene gegevens"]
[]
[]
[null,null,null,null,null,null,"Debiet"]
[null,null,null,null,null,null,"Toevoer",null,null,null,"Doorvoer",null,"Afvoer"]
[null,null,null,null,null,null,"Ontwerpdebiet",null,"mag beperkt worden tot","vrije toevoer maximum (A/C)","minimaal (afvoer uit ruimte)","minimaal (toevoer naar ruimte)","Ontwerpdebiet",null,"mag beperkt worden tot"]
[null,null,"Naam","Code","Soort ruimte","Opp","algemene regel","minimaal",null,null,null,null,"algemene regel","minimaal"]
[null,null,null,null,null,"(m²)","(m³/h)","(m³/h)","(m³/h)","(m³/h)","(m³/h)","(m³/h)","(m³/h)","(m³/h)","(m³/h)"]
[null,null,null,null,null,null,{"$f":"IF(E12=\"\",\"\",IF((VLOOKUP(E12,Data!$A$11:$F$31,6,FALSE)=1),ROUND('Algemene gegevens'!F12*VLOOKUP($E12,Data!$A$11:$F$31,2,FALSE),0),\"\"))","v":""},{"$f":"IF(E12=\"\",\"\",IF((VLOOKUP(E12,Data!$A$11:$F$31,6,FALSE)=1),VLOOKUP(E12,Data!$A$11:$D$31,3,FALSE),\"\"))","v":""},{"$f":"IF(E12=\"\",\"\",IF((VLOOKUP(E12,Data!$A$11:$F$31,6,FALSE)=1),VLOOKUP(E12,Data!$A$11:$D$31,4,FALSE),\"\"))","v":""},{"$f":"IF(E12=\"\",\"\",IF((VLOOKUP(E12,Data!$A$11:$F$31,6,FALSE)=1),IF((2*(VLOOKUP(E12,Data!$A$11:$D$31,2,FALSE)*F12))<(2*(VLOOKUP(E12,Data!$A$11:$D$31,3,FALSE))),ROUND(2*(VLOOKUP(E12,Data!$A$11:$D$31,3,FALSE)),0),ROUND(2*(VLOOKUP(E12,Data!$A$11:$D$31,2,FALSE))*F12,0)),\"\"))","v":""},{"$f":"IF(E12=\"\",\"\",IF((VLOOKUP(E12,Data!$A$11:$F$31,6,FALSE)=1),ROUND(VLOOKUP($E12,Data!$A$11:$F$31,5,FALSE),0),\"\"))","v":""},{"$f":"IF(E12=\"\",\"\",IF((VLOOKUP(E12,Data!$A$11:$F$31,6,FALSE)=2),ROUND(VLOOKUP($E12,Data!$A$11:$F$31,5,FALSE),0),\"\"))","v":""},{"$f":"IF(E12=\"\",\"\",IF(E12=\"WC\",\"\",IF((VLOOKUP(E12,Data!$A$11:$F$31,6,FALSE)=2),ROUND('Algemene gegevens'!F12*VLOOKUP($E12,Data!$A$11:$F$31,2,FALSE),0),\"\")))","v":""},{"$f":"IF($E12=\"\",\"\",IF((VLOOKUP($E12,Data!$A$11:$F$31,6,FALSE)=2),VLOOKUP($E12,Data!$A$11:$D$31,3,FALSE),\"\"))","v":""},{"$f":"IF($E12=\"\",\"\",IF((VLOOKUP($E12,Data!$A$11:$F$31,6,FALSE)=2),VLOOKUP($E12,Data!$A$11:$D$31,4,FALSE),\"\"))","v":""}]
[null,null,null,null,null,null,{"$f":"IF(E13=\"\",\"\",IF((VLOOKUP(E13,Data!$A$11:$F$31,6,FALSE)=1),ROUND('Algemene gegevens'!F13*VLOOKUP($E13,Data!$A$11:$F$31,2,FALSE),0),\"\"))","v":""},{"$f":"IF(E13=\"\",\"\",IF((VLOOKUP(E13,Data!$A$11:$F$31,6,FALSE)=1),VLOOKUP(E13,Data!$A$11:$D$31,3,FALSE),\"\"))","v":""},{"$f":"IF(E13=\"\",\"\",IF((VLOOKUP(E13,Data!$A$11:$F$31,6,FALSE)=1),VLOOKUP(E13,Data!$A$11:$D$31,4,FALSE),\"\"))","v":""},{"$f":"IF(E13=\"\",\"\",IF((VLOOKUP(E13,Data!$A$11:$F$31,6,FALSE)=1),IF((2*(VLOOKUP(E13,Data!$A$11:$D$31,2,FALSE)*F13))<(2*(VLOOKUP(E13,Data!$A$11:$D$31,3,FALSE))),ROUND(2*(VLOOKUP(E13,Data!$A$11:$D$31,3,FALSE)),0),ROUND(2*(VLOOKUP(E13,Data!$A$11:$D$31,2,FALSE))*F13,0)),\"\"))","v":""},{"$f":"IF(E13=\"\",\"\",IF((VLOOKUP(E13,Data!$A$11:$F$31,6,FALSE)=1),ROUND(VLOOKUP($E13,Data!$A$11:$F$31,5,FALSE),0),\"\"))","v":""},{"$f":"IF(E13=\"\",\"\",IF((VLOOKUP(E13,Data!$A$11:$F$31,6,FALSE)=2),ROUND(VLOOKUP($E13,Data!$A$11:$F$31,5,FALSE),0),\"\"))","v":""},{"$f":"IF(E13=\"\",\"\",IF(E13=\"WC\",\"\",IF((VLOOKUP(E13,Data!$A$11:$F$31,6,FALSE)=2),ROUND('Algemene gegevens'!F13*VLOOKUP($E13,Data!$A$11:$F$31,2,FALSE),0),\"\")))","v":""},{"$f":"IF($E13=\"\",\"\",IF((VLOOKUP($E13,Data!$A$11:$F$31,6,FALSE)=2),VLOOKUP($E13,Data!$A$11:$D$31,3,FALSE),\"\"))","v":""},{"$f":"IF($E13=\"\",\"\",IF((VLOOKUP($E13,Data!$A$11:$F$31,6,FALSE)=2),VLOOKUP($E13,Data!$A$11:$D$31,4,FALSE),\"\"))","v":""}]
[null,null,null,null,null,null,{"$f":"IF(E14=\"\",\"\",IF((VLOOKUP(E14,Data!$A$11:$F$31,6,FALSE)=1),ROUND('Algemene gegevens'!F14*VLOOKUP($E14,Data!$A$11:$F$31,2,FALSE),0),\"\"))","v":""},{"$f":"IF(E14=\"\",\"\",IF((VLOOKUP(E14,Data!$A$11:$F$31,6,FALSE)=1),VLOOKUP(E14,Data!$A$11:$D$31,3,FALSE),\"\"))","v":""},{"$f":"IF(E14=\"\",\"\",IF((VLOOKUP(E14,Data!$A$11:$F$31,6,FALSE)=1),VLOOKUP(E14,Data!$A$11:$D$31,4,FALSE),\"\"))","v":""},{"$f":"IF(E14=\"\",\"\",IF((VLOOKUP(E14,Data!$A$11:$F$31,6,FALSE)=1),IF((2*(VLOOKUP(E14,Data!$A$11:$D$31,2,FALSE)*F14))<(2*(VLOOKUP(E14,Data!$A$11:$D$31,3,FALSE))),ROUND(2*(VLOOKUP(E14,Data!$A$11:$D$31,3,FALSE)),0),ROUND(2*(VLOOKUP(E14,Data!$A$11:$D$31,2,FALSE))*F14,0)),\"\"))","v":""},{"$f":"IF(E14=\"\",\"\",IF((VLOOKUP(E14,Data!$A$11:$F$31,6,FALSE)=1),ROUND(VLOOKUP($E14,Data!$A$11:$F$31,5,FALSE),0),\"\"))","v":""},{"$f":"IF(E14=\"\",\"\",IF((VLOOKUP(E14,Data!$A$11:$F$31,6,FALSE)=2),ROUND(VLOOKUP($E14,Data!$A$11:$F$31,5,FALSE),0),\"\"))","v":""},{"$f":"IF(E14=\"\",\"\",IF(E14=\"WC\",\"\",IF((VLOOKUP(E14,Data!$A$11:$F$31,6,FALSE)=2),ROUND('Algemene gegevens'!F14*VLOOKUP($E14,Data!$A$11:$F$31,2,FALSE),0),\"\")))","v":""},{"$f":"IF($E14=\"\",\"\",IF((VLOOKUP($E14,Data!$A$11:$F$31,6,FALSE)=2),VLOOKUP($E14,Data!$A$11:$D$31,3,FALSE),\"\"))","v":""},{"$f":"IF($E14=\"\",\"\",IF((VLOOKUP($E14,Data!$A$11:$F$31,6,FALSE)=2),VLOOKUP($E14,Data!$A$11:$D$31,4,FALSE),\"\"))","v":""}]
[null,null,null,null,null,null,{"$f":"IF(E15=\"\",\"\",IF((VLOOKUP(E15,Data!$A$11:$F$31,6,FALSE)=1),ROUND('Algemene gegevens'!F15*VLOOKUP($E15,Data!$A$11:$F$31,2,FALSE),0),\"\"))","v":""},{"$f":"IF(E15=\"\",\"\",IF((VLOOKUP(E15,Data!$A$11:$F$31,6,FALSE)=1),VLOOKUP(E15,Data!$A$11:$D$31,3,FALSE),\"\"))","v":""},{"$f":"IF(E15=\"\",\"\",IF((VLOOKUP(E15,Data!$A$11:$F$31,6,FALSE)=1),VLOOKUP(E15,Data!$A$11:$D$31,4,FALSE),\"\"))","v":""},{"$f":"IF(E15=\"\",\"\",IF((VLOOKUP(E15,Data!$A$11:$F$31,6,FALSE)=1),IF((2*(VLOOKUP(E15,Data!$A$11:$D$31,2,FALSE)*F15))<(2*(VLOOKUP(E15,Data!$A$11:$D$31,3,FALSE))),ROUND(2*(VLOOKUP(E15,Data!$A$11:$D$31,3,FALSE)),0),ROUND(2*(VLOOKUP(E15,Data!$A$11:$D$31,2,FALSE))*F15,0)),\"\"))","v":""},{"$f":"IF(E15=\"\",\"\",IF((VLOOKUP(E15,Data!$A$11:$F$31,6,FALSE)=1),ROUND(VLOOKUP($E15,Data!$A$11:$F$31,5,FALSE),0),\"\"))","v":""},{"$f":"IF(E15=\"\",\"\",IF((VLOOKUP(E15,Data!$A$11:$F$31,6,FALSE)=2),ROUND(VLOOKUP($E15,Data!$A$11:$F$31,5,FALSE),0),\"\"))","v":""},{"$f":"IF(E15=\"\",\"\",IF(E15=\"WC\",\"\",IF((VLOOKUP(E15,Data!$A$11:$F$31,6,FALSE)=2),ROUND('Algemene gegevens'!F15*VLOOKUP($E15,Data!$A$11:$F$31,2,FALSE),0),\"\")))","v":""},{"$f":"IF($E15=\"\",\"\",IF((VLOOKUP($E15,Data!$A$11:$F$31,6,FALSE)=2),VLOOKUP($E15,Data!$A$11:$D$31,3,FALSE),\"\"))","v":""},{"$f":"IF($E15=\"\",\"\",IF((VLOOKUP($E15,Data!$A$11:$F$31,6,FALSE)=2),VLOOKUP($E15,Data!$A$11:$D$31,4,FALSE),\"\"))","v":""}]
[null,null,null,null,null,null,{"$f":"IF(E16=\"\",\"\",IF((VLOOKUP(E16,Data!$A$11:$F$31,6,FALSE)=1),ROUND('Algemene gegevens'!F16*VLOOKUP($E16,Data!$A$11:$F$31,2,FALSE),0),\"\"))","v":""},{"$f":"IF(E16=\"\",\"\",IF((VLOOKUP(E16,Data!$A$11:$F$31,6,FALSE)=1),VLOOKUP(E16,Data!$A$11:$D$31,3,FALSE),\"\"))","v":""},{"$f":"IF(E16=\"\",\"\",IF((VLOOKUP(E16,Data!$A$11:$F$31,6,FALSE)=1),VLOOKUP(E16,Data!$A$11:$D$31,4,FALSE),\"\"))","v":""},{"$f":"IF(E16=\"\",\"\",IF((VLOOKUP(E16,Data!$A$11:$F$31,6,FALSE)=1),IF((2*(VLOOKUP(E16,Data!$A$11:$D$31,2,FALSE)*F16))<(2*(VLOOKUP(E16,Data!$A$11:$D$31,3,FALSE))),ROUND(2*(VLOOKUP(E16,Data!$A$11:$D$31,3,FALSE)),0),ROUND(2*(VLOOKUP(E16,Data!$A$11:$D$31,2,FALSE))*F16,0)),\"\"))","v":""},{"$f":"IF(E16=\"\",\"\",IF((VLOOKUP(E16,Data!$A$11:$F$31,6,FALSE)=1),ROUND(VLOOKUP($E16,Data!$A$11:$F$31,5,FALSE),0),\"\"))","v":""},{"$f":"IF(E16=\"\",\"\",IF((VLOOKUP(E16,Data!$A$11:$F$31,6,FALSE)=2),ROUND(VLOOKUP($E16,Data!$A$11:$F$31,5,FALSE),0),\"\"))","v":""},{"$f":"IF(E16=\"\",\"\",IF(E16=\"WC\",\"\",IF((VLOOKUP(E16,Data!$A$11:$F$31,6,FALSE)=2),ROUND('Algemene gegevens'!F16*VLOOKUP($E16,Data!$A$11:$F$31,2,FALSE),0),\"\")))","v":""},{"$f":"IF($E16=\"\",\"\",IF((VLOOKUP($E16,Data!$A$11:$F$31,6,FALSE)=2),VLOOKUP($E16,Data!$A$11:$D$31,3,FALSE),\"\"))","v":""},{"$f":"IF($E16=\"\",\"\",IF((VLOOKUP($E16,Data!$A$11:$F$31,6,FALSE)=2),VLOOKUP($E16,Data!$A$11:$D$31,4,FALSE),\"\"))","v":""}]
[null,null,null,null,null,null,{"$f":"IF(E17=\"\",\"\",IF((VLOOKUP(E17,Data!$A$11:$F$31,6,FALSE)=1),ROUND('Algemene gegevens'!F17*VLOOKUP($E17,Data!$A$11:$F$31,2,FALSE),0),\"\"))","v":""},{"$f":"IF(E17=\"\",\"\",IF((VLOOKUP(E17,Data!$A$11:$F$31,6,FALSE)=1),VLOOKUP(E17,Data!$A$11:$D$31,3,FALSE),\"\"))","v":""},{"$f":"IF(E17=\"\",\"\",IF((VLOOKUP(E17,Data!$A$11:$F$31,6,FALSE)=1),VLOOKUP(E17,Data!$A$11:$D$31,4,FALSE),\"\"))","v":""},{"$f":"IF(E17=\"\",\"\",IF((VLOOKUP(E17,Data!$A$11:$F$31,6,FALSE)=1),IF((2*(VLOOKUP(E17,Data!$A$11:$D$31,2,FALSE)*F17))<(2*(VLOOKUP(E17,Data!$A$11:$D$31,3,FALSE))),ROUND(2*(VLOOKUP(E17,Data!$A$11:$D$31,3,FALSE)),0),ROUND(2*(VLOOKUP(E17,Data!$A$11:$D$31,2,FALSE))*F17,0)),\"\"))","v":""},{"$f":"IF(E17=\"\",\"\",IF((VLOOKUP(E17,Data!$A$11:$F$31,6,FALSE)=1),ROUND(VLOOKUP($E17,Data!$A$11:$F$31,5,FALSE),0),\"\"))","v":""},{"$f":"IF(E17=\"\",\"\",IF((VLOOKUP(E17,Data!$A$11:$F$31,6,FALSE)=2),ROUND(VLOOKUP($E17,Data!$A$11:$F$31,5,FALSE),0),\"\"))","v":""},{"$f":"IF(E17=\"\",\"\",IF(E17=\"WC\",\"\",IF((VLOOKUP(E17,Data!$A$11:$F$31,6,FALSE)=2),ROUND('Algemene gegevens'!F17*VLOOKUP($E17,Data!$A$11:$F$31,2,FALSE),0),\"\")))","v":""},{"$f":"IF($E17=\"\",\"\",IF((VLOOKUP($E17,Data!$A$11:$F$31,6,FALSE)=2),VLOOKUP($E17,Data!$A$11:$D$31,3,FALSE),\"\"))","v":""},{"$f":"IF($E17=\"\",\"\",IF((VLOOKUP($E17,Data!$A$11:$F$31,6,FALSE)=2),VLOOKUP($E17,Data!$A$11:$D$31,4,FALSE),\"\"))","v":""}]
[null,null,null,null,null,null,{"$f":"IF(E18=\"\",\"\",IF((VLOOKUP(E18,Data!$A$11:$F$31,6,FALSE)=1),ROUND('Algemene gegevens'!F18*VLOOKUP($E18,Data!$A$11:$F$31,2,FALSE),0),\"\"))","v":""},{"$f":"IF(E18=\"\",\"\",IF((VLOOKUP(E18,Data!$A$11:$F$31,6,FALSE)=1),VLOOKUP(E18,Data!$A$11:$D$31,3,FALSE),\"\"))","v":""},{"$f":"IF(E18=\"\",\"\",IF((VLOOKUP(E18,Data!$A$11:$F$31,6,FALSE)=1),VLOOKUP(E18,Data!$A$11:$D$31,4,FALSE),\"\"))","v":""},{"$f":"IF(E18=\"\",\"\",IF((VLOOKUP(E18,Data!$A$11:$F$31,6,FALSE)=1),IF((2*(VLOOKUP(E18,Data!$A$11:$D$31,2,FALSE)*F18))<(2*(VLOOKUP(E18,Data!$A$11:$D$31,3,FALSE))),ROUND(2*(VLOOKUP(E18,Data!$A$11:$D$31,3,FALSE)),0),ROUND(2*(VLOOKUP(E18,Data!$A$11:$D$31,2,FALSE))*F18,0)),\"\"))","v":""},{"$f":"IF(E18=\"\",\"\",IF((VLOOKUP(E18,Data!$A$11:$F$31,6,FALSE)=1),ROUND(VLOOKUP($E18,Data!$A$11:$F$31,5,FALSE),0),\"\"))","v":""},{"$f":"IF(E18=\"\",\"\",IF((VLOOKUP(E18,Data!$A$11:$F$31,6,FALSE)=2),ROUND(VLOOKUP($E18,Data!$A$11:$F$31,5,FALSE),0),\"\"))","v":""},{"$f":"IF(E18=\"\",\"\",IF(E18=\"WC\",\"\",IF((VLOOKUP(E18,Data!$A$11:$F$31,6,FALSE)=2),ROUND('Algemene gegevens'!F18*VLOOKUP($E18,Data!$A$11:$F$31,2,FALSE),0),\"\")))","v":""},{"$f":"IF($E18=\"\",\"\",IF((VLOOKUP($E18,Data!$A$11:$F$31,6,FALSE)=2),VLOOKUP($E18,Data!$A$11:$D$31,3,FALSE),\"\"))","v":""},{"$f":"IF($E18=\"\",\"\",IF((VLOOKUP($E18,Data!$A$11:$F$31,6,FALSE)=2),VLOOKUP($E18,Data!$A$11:$D$31,4,FALSE),\"\"))","v":""}]
[null,null,null,null,null,null,{"$f":"IF(E19=\"\",\"\",IF((VLOOKUP(E19,Data!$A$11:$F$31,6,FALSE)=1),ROUND('Algemene gegevens'!F19*VLOOKUP($E19,Data!$A$11:$F$31,2,FALSE),0),\"\"))","v":""},{"$f":"IF(E19=\"\",\"\",IF((VLOOKUP(E19,Data!$A$11:$F$31,6,FALSE)=1),VLOOKUP(E19,Data!$A$11:$D$31,3,FALSE),\"\"))","v":""},{"$f":"IF(E19=\"\",\"\",IF((VLOOKUP(E19,Data!$A$11:$F$31,6,FALSE)=1),VLOOKUP(E19,Data!$A$11:$D$31,4,FALSE),\"\"))","v":""},{"$f":"IF(E19=\"\",\"\",IF((VLOOKUP(E19,Data!$A$11:$F$31,6,FALSE)=1),IF((2*(VLOOKUP(E19,Data!$A$11:$D$31,2,FALSE)*F19))<(2*(VLOOKUP(E19,Data!$A$11:$D$31,3,FALSE))),ROUND(2*(VLOOKUP(E19,Data!$A$11:$D$31,3,FALSE)),0),ROUND(2*(VLOOKUP(E19,Data!$A$11:$D$31,2,FALSE))*F19,0)),\"\"))","v":""},{"$f":"IF(E19=\"\",\"\",IF((VLOOKUP(E19,Data!$A$11:$F$31,6,FALSE)=1),ROUND(VLOOKUP($E19,Data!$A$11:$F$31,5,FALSE),0),\"\"))","v":""},{"$f":"IF(E19=\"\",\"\",IF((VLOOKUP(E19,Data!$A$11:$F$31,6,FALSE)=2),ROUND(VLOOKUP($E19,Data!$A$11:$F$31,5,FALSE),0),\"\"))","v":""},{"$f":"IF(E19=\"\",\"\",IF(E19=\"WC\",\"\",IF((VLOOKUP(E19,Data!$A$11:$F$31,6,FALSE)=2),ROUND('Algemene gegevens'!F19*VLOOKUP($E19,Data!$A$11:$F$31,2,FALSE),0),\"\")))","v":""},{"$f":"IF($E19=\"\",\"\",IF((VLOOKUP($E19,Data!$A$11:$F$31,6,FALSE)=2),VLOOKUP($E19,Data!$A$11:$D$31,3,FALSE),\"\"))","v":""},{"$f":"IF($E19=\"\",\"\",IF((VLOOKUP($E19,Data!$A$11:$F$31,6,FALSE)=2),VLOOKUP($E19,Data!$A$11:$D$31,4,FALSE),\"\"))","v":""}]
[null,null,null,null,null,null,{"$f":"IF(E20=\"\",\"\",IF((VLOOKUP(E20,Data!$A$11:$F$31,6,FALSE)=1),ROUND('Algemene gegevens'!F20*VLOOKUP($E20,Data!$A$11:$F$31,2,FALSE),0),\"\"))","v":""},{"$f":"IF(E20=\"\",\"\",IF((VLOOKUP(E20,Data!$A$11:$F$31,6,FALSE)=1),VLOOKUP(E20,Data!$A$11:$D$31,3,FALSE),\"\"))","v":""},{"$f":"IF(E20=\"\",\"\",IF((VLOOKUP(E20,Data!$A$11:$F$31,6,FALSE)=1),VLOOKUP(E20,Data!$A$11:$D$31,4,FALSE),\"\"))","v":""},{"$f":"IF(E20=\"\",\"\",IF((VLOOKUP(E20,Data!$A$11:$F$31,6,FALSE)=1),IF((2*(VLOOKUP(E20,Data!$A$11:$D$31,2,FALSE)*F20))<(2*(VLOOKUP(E20,Data!$A$11:$D$31,3,FALSE))),ROUND(2*(VLOOKUP(E20,Data!$A$11:$D$31,3,FALSE)),0),ROUND(2*(VLOOKUP(E20,Data!$A$11:$D$31,2,FALSE))*F20,0)),\"\"))","v":""},{"$f":"IF(E20=\"\",\"\",IF((VLOOKUP(E20,Data!$A$11:$F$31,6,FALSE)=1),ROUND(VLOOKUP($E20,Data!$A$11:$F$31,5,FALSE),0),\"\"))","v":""},{"$f":"IF(E20=\"\",\"\",IF((VLOOKUP(E20,Data!$A$11:$F$31,6,FALSE)=2),ROUND(VLOOKUP($E20,Data!$A$11:$F$31,5,FALSE),0),\"\"))","v":""},{"$f":"IF(E20=\"\",\"\",IF(E20=\"WC\",\"\",IF((VLOOKUP(E20,Data!$A$11:$F$31,6,FALSE)=2),ROUND('Algemene gegevens'!F20*VLOOKUP($E20,Data!$A$11:$F$31,2,FALSE),0),\"\")))","v":""},{"$f":"IF($E20=\"\",\"\",IF((VLOOKUP($E20,Data!$A$11:$F$31,6,FALSE)=2),VLOOKUP($E20,Data!$A$11:$D$31,3,FALSE),\"\"))","v":""},{"$f":"IF($E20=\"\",\"\",IF((VLOOKUP($E20,Data!$A$11:$F$31,6,FALSE)=2),VLOOKUP($E20,Data!$A$11:$D$31,4,FALSE),\"\"))","v":""}]
[null,null,null,null,null,null,{"$f":"IF(E21=\"\",\"\",IF((VLOOKUP(E21,Data!$A$11:$F$31,6,FALSE)=1),ROUND('Algemene gegevens'!F21*VLOOKUP($E21,Data!$A$11:$F$31,2,FALSE),0),\"\"))","v":""},{"$f":"IF(E21=\"\",\"\",IF((VLOOKUP(E21,Data!$A$11:$F$31,6,FALSE)=1),VLOOKUP(E21,Data!$A$11:$D$31,3,FALSE),\"\"))","v":""},{"$f":"IF(E21=\"\",\"\",IF((VLOOKUP(E21,Data!$A$11:$F$31,6,FALSE)=1),VLOOKUP(E21,Data!$A$11:$D$31,4,FALSE),\"\"))","v":""},{"$f":"IF(E21=\"\",\"\",IF((VLOOKUP(E21,Data!$A$11:$F$31,6,FALSE)=1),IF((2*(VLOOKUP(E21,Data!$A$11:$D$31,2,FALSE)*F21))<(2*(VLOOKUP(E21,Data!$A$11:$D$31,3,FALSE))),ROUND(2*(VLOOKUP(E21,Data!$A$11:$D$31,3,FALSE)),0),ROUND(2*(VLOOKUP(E21,Data!$A$11:$D$31,2,FALSE))*F21,0)),\"\"))","v":""},{"$f":"IF(E21=\"\",\"\",IF((VLOOKUP(E21,Data!$A$11:$F$31,6,FALSE)=1),ROUND(VLOOKUP($E21,Data!$A$11:$F$31,5,FALSE),0),\"\"))","v":""},{"$f":"IF(E21=\"\",\"\",IF((VLOOKUP(E21,Data!$A$11:$F$31,6,FALSE)=2),ROUND(VLOOKUP($E21,Data!$A$11:$F$31,5,FALSE),0),\"\"))","v":""},{"$f":"IF(E21=\"\",\"\",IF(E21=\"WC\",\"\",IF((VLOOKUP(E21,Data!$A$11:$F$31,6,FALSE)=2),ROUND('Algemene gegevens'!F21*VLOOKUP($E21,Data!$A$11:$F$31,2,FALSE),0),\"\")))","v":""},{"$f":"IF($E21=\"\",\"\",IF((VLOOKUP($E21,Data!$A$11:$F$31,6,FALSE)=2),VLOOKUP($E21,Data!$A$11:$D$31,3,FALSE),\"\"))","v":""},{"$f":"IF($E21=\"\",\"\",IF((VLOOKUP($E21,Data!$A$11:$F$31,6,FALSE)=2),VLOOKUP($E21,Data!$A$11:$D$31,4,FALSE),\"\"))","v":""}]
[null,null,null,null,null,null,{"$f":"IF(E22=\"\",\"\",IF((VLOOKUP(E22,Data!$A$11:$F$31,6,FALSE)=1),ROUND('Algemene gegevens'!F22*VLOOKUP($E22,Data!$A$11:$F$31,2,FALSE),0),\"\"))","v":""},{"$f":"IF(E22=\"\",\"\",IF((VLOOKUP(E22,Data!$A$11:$F$31,6,FALSE)=1),VLOOKUP(E22,Data!$A$11:$D$31,3,FALSE),\"\"))","v":""},{"$f":"IF(E22=\"\",\"\",IF((VLOOKUP(E22,Data!$A$11:$F$31,6,FALSE)=1),VLOOKUP(E22,Data!$A$11:$D$31,4,FALSE),\"\"))","v":""},{"$f":"IF(E22=\"\",\"\",IF((VLOOKUP(E22,Data!$A$11:$F$31,6,FALSE)=1),IF((2*(VLOOKUP(E22,Data!$A$11:$D$31,2,FALSE)*F22))<(2*(VLOOKUP(E22,Data!$A$11:$D$31,3,FALSE))),ROUND(2*(VLOOKUP(E22,Data!$A$11:$D$31,3,FALSE)),0),ROUND(2*(VLOOKUP(E22,Data!$A$11:$D$31,2,FALSE))*F22,0)),\"\"))","v":""},{"$f":"IF(E22=\"\",\"\",IF((VLOOKUP(E22,Data!$A$11:$F$31,6,FALSE)=1),ROUND(VLOOKUP($E22,Data!$A$11:$F$31,5,FALSE),0),\"\"))","v":""},{"$f":"IF(E22=\"\",\"\",IF((VLOOKUP(E22,Data!$A$11:$F$31,6,FALSE)=2),ROUND(VLOOKUP($E22,Data!$A$11:$F$31,5,FALSE),0),\"\"))","v":""},{"$f":"IF(E22=\"\",\"\",IF(E22=\"WC\",\"\",IF((VLOOKUP(E22,Data!$A$11:$F$31,6,FALSE)=2),ROUND('Algemene gegevens'!F22*VLOOKUP($E22,Data!$A$11:$F$31,2,FALSE),0),\"\")))","v":""},{"$f":"IF($E22=\"\",\"\",IF((VLOOKUP($E22,Data!$A$11:$F$31,6,FALSE)=2),VLOOKUP($E22,Data!$A$11:$D$31,3,FALSE),\"\"))","v":""},{"$f":"IF($E22=\"\",\"\",IF((VLOOKUP($E22,Data!$A$11:$F$31,6,FALSE)=2),VLOOKUP($E22,Data!$A$11:$D$31,4,FALSE),\"\"))","v":""}]
[null,null,null,null,null,null,{"$f":"IF(E23=\"\",\"\",IF((VLOOKUP(E23,Data!$A$11:$F$31,6,FALSE)=1),ROUND('Algemene gegevens'!F23*VLOOKUP($E23,Data!$A$11:$F$31,2,FALSE),0),\"\"))","v":""},{"$f":"IF(E23=\"\",\"\",IF((VLOOKUP(E23,Data!$A$11:$F$31,6,FALSE)=1),VLOOKUP(E23,Data!$A$11:$D$31,3,FALSE),\"\"))","v":""},{"$f":"IF(E23=\"\",\"\",IF((VLOOKUP(E23,Data!$A$11:$F$31,6,FALSE)=1),VLOOKUP(E23,Data!$A$11:$D$31,4,FALSE),\"\"))","v":""},{"$f":"IF(E23=\"\",\"\",IF((VLOOKUP(E23,Data!$A$11:$F$31,6,FALSE)=1),IF((2*(VLOOKUP(E23,Data!$A$11:$D$31,2,FALSE)*F23))<(2*(VLOOKUP(E23,Data!$A$11:$D$31,3,FALSE))),ROUND(2*(VLOOKUP(E23,Data!$A$11:$D$31,3,FALSE)),0),ROUND(2*(VLOOKUP(E23,Data!$A$11:$D$31,2,FALSE))*F23,0)),\"\"))","v":""},{"$f":"IF(E23=\"\",\"\",IF((VLOOKUP(E23,Data!$A$11:$F$31,6,FALSE)=1),ROUND(VLOOKUP($E23,Data!$A$11:$F$31,5,FALSE),0),\"\"))","v":""},{"$f":"IF(E23=\"\",\"\",IF((VLOOKUP(E23,Data!$A$11:$F$31,6,FALSE)=2),ROUND(VLOOKUP($E23,Data!$A$11:$F$31,5,FALSE),0),\"\"))","v":""},{"$f":"IF(E23=\"\",\"\",IF(E23=\"WC\",\"\",IF((VLOOKUP(E23,Data!$A$11:$F$31,6,FALSE)=2),ROUND('Algemene gegevens'!F23*VLOOKUP($E23,Data!$A$11:$F$31,2,FALSE),0),\"\")))","v":""},{"$f":"IF($E23=\"\",\"\",IF((VLOOKUP($E23,Data!$A$11:$F$31,6,FALSE)=2),VLOOKUP($E23,Data!$A$11:$D$31,3,FALSE),\"\"))","v":""},{"$f":"IF($E23=\"\",\"\",IF((VLOOKUP($E23,Data!$A$11:$F$31,6,FALSE)=2),VLOOKUP($E23,Data!$A$11:$D$31,4,FALSE),\"\"))","v":""}]
[null,null,null,null,null,null,{"$f":"IF(E24=\"\",\"\",IF((VLOOKUP(E24,Data!$A$11:$F$31,6,FALSE)=1),ROUND('Algemene gegevens'!F24*VLOOKUP($E24,Data!$A$11:$F$31,2,FALSE),0),\"\"))","v":""},{"$f":"IF(E24=\"\",\"\",IF((VLOOKUP(E24,Data!$A$11:$F$31,6,FALSE)=1),VLOOKUP(E24,Data!$A$11:$D$31,3,FALSE),\"\"))","v":""},{"$f":"IF(E24=\"\",\"\",IF((VLOOKUP(E24,Data!$A$11:$F$31,6,FALSE)=1),VLOOKUP(E24,Data!$A$11:$D$31,4,FALSE),\"\"))","v":""},{"$f":"IF(E24=\"\",\"\",IF((VLOOKUP(E24,Data!$A$11:$F$31,6,FALSE)=1),IF((2*(VLOOKUP(E24,Data!$A$11:$D$31,2,FALSE)*F24))<(2*(VLOOKUP(E24,Data!$A$11:$D$31,3,FALSE))),ROUND(2*(VLOOKUP(E24,Data!$A$11:$D$31,3,FALSE)),0),ROUND(2*(VLOOKUP(E24,Data!$A$11:$D$31,2,FALSE))*F24,0)),\"\"))","v":""},{"$f":"IF(E24=\"\",\"\",IF((VLOOKUP(E24,Data!$A$11:$F$31,6,FALSE)=1),ROUND(VLOOKUP($E24,Data!$A$11:$F$31,5,FALSE),0),\"\"))","v":""},{"$f":"IF(E24=\"\",\"\",IF((VLOOKUP(E24,Data!$A$11:$F$31,6,FALSE)=2),ROUND(VLOOKUP($E24,Data!$A$11:$F$31,5,FALSE),0),\"\"))","v":""},{"$f":"IF(E24=\"\",\"\",IF(E24=\"WC\",\"\",IF((VLOOKUP(E24,Data!$A$11:$F$31,6,FALSE)=2),ROUND('Algemene gegevens'!F24*VLOOKUP($E24,Data!$A$11:$F$31,2,FALSE),0),\"\")))","v":""},{"$f":"IF($E24=\"\",\"\",IF((VLOOKUP($E24,Data!$A$11:$F$31,6,FALSE)=2),VLOOKUP($E24,Data!$A$11:$D$31,3,FALSE),\"\"))","v":""},{"$f":"IF($E24=\"\",\"\",IF((VLOOKUP($E24,Data!$A$11:$F$31,6,FALSE)=2),VLOOKUP($E24,Data!$A$11:$D$31,4,FALSE),\"\"))","v":""}]
[null,null,null,null,null,null,{"$f":"IF(E25=\"\",\"\",IF((VLOOKUP(E25,Data!$A$11:$F$31,6,FALSE)=1),ROUND('Algemene gegevens'!F25*VLOOKUP($E25,Data!$A$11:$F$31,2,FALSE),0),\"\"))","v":""},{"$f":"IF(E25=\"\",\"\",IF((VLOOKUP(E25,Data!$A$11:$F$31,6,FALSE)=1),VLOOKUP(E25,Data!$A$11:$D$31,3,FALSE),\"\"))","v":""},{"$f":"IF(E25=\"\",\"\",IF((VLOOKUP(E25,Data!$A$11:$F$31,6,FALSE)=1),VLOOKUP(E25,Data!$A$11:$D$31,4,FALSE),\"\"))","v":""},{"$f":"IF(E25=\"\",\"\",IF((VLOOKUP(E25,Data!$A$11:$F$31,6,FALSE)=1),IF((2*(VLOOKUP(E25,Data!$A$11:$D$31,2,FALSE)*F25))<(2*(VLOOKUP(E25,Data!$A$11:$D$31,3,FALSE))),ROUND(2*(VLOOKUP(E25,Data!$A$11:$D$31,3,FALSE)),0),ROUND(2*(VLOOKUP(E25,Data!$A$11:$D$31,2,FALSE))*F25,0)),\"\"))","v":""},{"$f":"IF(E25=\"\",\"\",IF((VLOOKUP(E25,Data!$A$11:$F$31,6,FALSE)=1),ROUND(VLOOKUP($E25,Data!$A$11:$F$31,5,FALSE),0),\"\"))","v":""},{"$f":"IF(E25=\"\",\"\",IF((VLOOKUP(E25,Data!$A$11:$F$31,6,FALSE)=2),ROUND(VLOOKUP($E25,Data!$A$11:$F$31,5,FALSE),0),\"\"))","v":""},{"$f":"IF(E25=\"\",\"\",IF(E25=\"WC\",\"\",IF((VLOOKUP(E25,Data!$A$11:$F$31,6,FALSE)=2),ROUND('Algemene gegevens'!F25*VLOOKUP($E25,Data!$A$11:$F$31,2,FALSE),0),\"\")))","v":""},{"$f":"IF($E25=\"\",\"\",IF((VLOOKUP($E25,Data!$A$11:$F$31,6,FALSE)=2),VLOOKUP($E25,Data!$A$11:$D$31,3,FALSE),\"\"))","v":""},{"$f":"IF($E25=\"\",\"\",IF((VLOOKUP($E25,Data!$A$11:$F$31,6,FALSE)=2),VLOOKUP($E25,Data!$A$11:$D$31,4,FALSE),\"\"))","v":""}]
[null,null,null,null,null,null,{"$f":"IF(E26=\"\",\"\",IF((VLOOKUP(E26,Data!$A$11:$F$31,6,FALSE)=1),ROUND('Algemene gegevens'!F26*VLOOKUP($E26,Data!$A$11:$F$31,2,FALSE),0),\"\"))","v":""},{"$f":"IF(E26=\"\",\"\",IF((VLOOKUP(E26,Data!$A$11:$F$31,6,FALSE)=1),VLOOKUP(E26,Data!$A$11:$D$31,3,FALSE),\"\"))","v":""},{"$f":"IF(E26=\"\",\"\",IF((VLOOKUP(E26,Data!$A$11:$F$31,6,FALSE)=1),VLOOKUP(E26,Data!$A$11:$D$31,4,FALSE),\"\"))","v":""},{"$f":"IF(E26=\"\",\"\",IF((VLOOKUP(E26,Data!$A$11:$F$31,6,FALSE)=1),IF((2*(VLOOKUP(E26,Data!$A$11:$D$31,2,FALSE)*F26))<(2*(VLOOKUP(E26,Data!$A$11:$D$31,3,FALSE))),ROUND(2*(VLOOKUP(E26,Data!$A$11:$D$31,3,FALSE)),0),ROUND(2*(VLOOKUP(E26,Data!$A$11:$D$31,2,FALSE))*F26,0)),\"\"))","v":""},{"$f":"IF(E26=\"\",\"\",IF((VLOOKUP(E26,Data!$A$11:$F$31,6,FALSE)=1),ROUND(VLOOKUP($E26,Data!$A$11:$F$31,5,FALSE),0),\"\"))","v":""},{"$f":"IF(E26=\"\",\"\",IF((VLOOKUP(E26,Data!$A$11:$F$31,6,FALSE)=2),ROUND(VLOOKUP($E26,Data!$A$11:$F$31,5,FALSE),0),\"\"))","v":""},{"$f":"IF(E26=\"\",\"\",IF(E26=\"WC\",\"\",IF((VLOOKUP(E26,Data!$A$11:$F$31,6,FALSE)=2),ROUND('Algemene gegevens'!F26*VLOOKUP($E26,Data!$A$11:$F$31,2,FALSE),0),\"\")))","v":""},{"$f":"IF($E26=\"\",\"\",IF((VLOOKUP($E26,Data!$A$11:$F$31,6,FALSE)=2),VLOOKUP($E26,Data!$A$11:$D$31,3,FALSE),\"\"))","v":""},{"$f":"IF($E26=\"\",\"\",IF((VLOOKUP($E26,Data!$A$11:$F$31,6,FALSE)=2),VLOOKUP($E26,Data!$A$11:$D$31,4,FALSE),\"\"))","v":""}]
[null,null,null,null,null,null,{"$f":"IF(E27=\"\",\"\",IF((VLOOKUP(E27,Data!$A$11:$F$31,6,FALSE)=1),ROUND('Algemene gegevens'!F27*VLOOKUP($E27,Data!$A$11:$F$31,2,FALSE),0),\"\"))","v":""},{"$f":"IF(E27=\"\",\"\",IF((VLOOKUP(E27,Data!$A$11:$F$31,6,FALSE)=1),VLOOKUP(E27,Data!$A$11:$D$31,3,FALSE),\"\"))","v":""},{"$f":"IF(E27=\"\",\"\",IF((VLOOKUP(E27,Data!$A$11:$F$31,6,FALSE)=1),VLOOKUP(E27,Data!$A$11:$D$31,4,FALSE),\"\"))","v":""},{"$f":"IF(E27=\"\",\"\",IF((VLOOKUP(E27,Data!$A$11:$F$31,6,FALSE)=1),IF((2*(VLOOKUP(E27,Data!$A$11:$D$31,2,FALSE)*F27))<(2*(VLOOKUP(E27,Data!$A$11:$D$31,3,FALSE))),ROUND(2*(VLOOKUP(E27,Data!$A$11:$D$31,3,FALSE)),0),ROUND(2*(VLOOKUP(E27,Data!$A$11:$D$31,2,FALSE))*F27,0)),\"\"))","v":""},{"$f":"IF(E27=\"\",\"\",IF((VLOOKUP(E27,Data!$A$11:$F$31,6,FALSE)=1),ROUND(VLOOKUP($E27,Data!$A$11:$F$31,5,FALSE),0),\"\"))","v":""},{"$f":"IF(E27=\"\",\"\",IF((VLOOKUP(E27,Data!$A$11:$F$31,6,FALSE)=2),ROUND(VLOOKUP($E27,Data!$A$11:$F$31,5,FALSE),0),\"\"))","v":""},{"$f":"IF(E27=\"\",\"\",IF(E27=\"WC\",\"\",IF((VLOOKUP(E27,Data!$A$11:$F$31,6,FALSE)=2),ROUND('Algemene gegevens'!F27*VLOOKUP($E27,Data!$A$11:$F$31,2,FALSE),0),\"\")))","v":""},{"$f":"IF($E27=\"\",\"\",IF((VLOOKUP($E27,Data!$A$11:$F$31,6,FALSE)=2),VLOOKUP($E27,Data!$A$11:$D$31,3,FALSE),\"\"))","v":""},{"$f":"IF($E27=\"\",\"\",IF((VLOOKUP($E27,Data!$A$11:$F$31,6,FALSE)=2),VLOOKUP($E27,Data!$A$11:$D$31,4,FALSE),\"\"))","v":""}]
[null,null,null,null,null,null,{"$f":"IF(E28=\"\",\"\",IF((VLOOKUP(E28,Data!$A$11:$F$31,6,FALSE)=1),ROUND('Algemene gegevens'!F28*VLOOKUP($E28,Data!$A$11:$F$31,2,FALSE),0),\"\"))","v":""},{"$f":"IF(E28=\"\",\"\",IF((VLOOKUP(E28,Data!$A$11:$F$31,6,FALSE)=1),VLOOKUP(E28,Data!$A$11:$D$31,3,FALSE),\"\"))","v":""},{"$f":"IF(E28=\"\",\"\",IF((VLOOKUP(E28,Data!$A$11:$F$31,6,FALSE)=1),VLOOKUP(E28,Data!$A$11:$D$31,4,FALSE),\"\"))","v":""},{"$f":"IF(E28=\"\",\"\",IF((VLOOKUP(E28,Data!$A$11:$F$31,6,FALSE)=1),IF((2*(VLOOKUP(E28,Data!$A$11:$D$31,2,FALSE)*F28))<(2*(VLOOKUP(E28,Data!$A$11:$D$31,3,FALSE))),ROUND(2*(VLOOKUP(E28,Data!$A$11:$D$31,3,FALSE)),0),ROUND(2*(VLOOKUP(E28,Data!$A$11:$D$31,2,FALSE))*F28,0)),\"\"))","v":""},{"$f":"IF(E28=\"\",\"\",IF((VLOOKUP(E28,Data!$A$11:$F$31,6,FALSE)=1),ROUND(VLOOKUP($E28,Data!$A$11:$F$31,5,FALSE),0),\"\"))","v":""},{"$f":"IF(E28=\"\",\"\",IF((VLOOKUP(E28,Data!$A$11:$F$31,6,FALSE)=2),ROUND(VLOOKUP($E28,Data!$A$11:$F$31,5,FALSE),0),\"\"))","v":""},{"$f":"IF(E28=\"\",\"\",IF(E28=\"WC\",\"\",IF((VLOOKUP(E28,Data!$A$11:$F$31,6,FALSE)=2),ROUND('Algemene gegevens'!F28*VLOOKUP($E28,Data!$A$11:$F$31,2,FALSE),0),\"\")))","v":""},{"$f":"IF($E28=\"\",\"\",IF((VLOOKUP($E28,Data!$A$11:$F$31,6,FALSE)=2),VLOOKUP($E28,Data!$A$11:$D$31,3,FALSE),\"\"))","v":""},{"$f":"IF($E28=\"\",\"\",IF((VLOOKUP($E28,Data!$A$11:$F$31,6,FALSE)=2),VLOOKUP($E28,Data!$A$11:$D$31,4,FALSE),\"\"))","v":""}]
[null,null,null,null,null,null,{"$f":"IF(E29=\"\",\"\",IF((VLOOKUP(E29,Data!$A$11:$F$31,6,FALSE)=1),ROUND('Algemene gegevens'!F29*VLOOKUP($E29,Data!$A$11:$F$31,2,FALSE),0),\"\"))","v":""},{"$f":"IF(E29=\"\",\"\",IF((VLOOKUP(E29,Data!$A$11:$F$31,6,FALSE)=1),VLOOKUP(E29,Data!$A$11:$D$31,3,FALSE),\"\"))","v":""},{"$f":"IF(E29=\"\",\"\",IF((VLOOKUP(E29,Data!$A$11:$F$31,6,FALSE)=1),VLOOKUP(E29,Data!$A$11:$D$31,4,FALSE),\"\"))","v":""},{"$f":"IF(E29=\"\",\"\",IF((VLOOKUP(E29,Data!$A$11:$F$31,6,FALSE)=1),IF((2*(VLOOKUP(E29,Data!$A$11:$D$31,2,FALSE)*F29))<(2*(VLOOKUP(E29,Data!$A$11:$D$31,3,FALSE))),ROUND(2*(VLOOKUP(E29,Data!$A$11:$D$31,3,FALSE)),0),ROUND(2*(VLOOKUP(E29,Data!$A$11:$D$31,2,FALSE))*F29,0)),\"\"))","v":""},{"$f":"IF(E29=\"\",\"\",IF((VLOOKUP(E29,Data!$A$11:$F$31,6,FALSE)=1),ROUND(VLOOKUP($E29,Data!$A$11:$F$31,5,FALSE),0),\"\"))","v":""},{"$f":"IF(E29=\"\",\"\",IF((VLOOKUP(E29,Data!$A$11:$F$31,6,FALSE)=2),ROUND(VLOOKUP($E29,Data!$A$11:$F$31,5,FALSE),0),\"\"))","v":""},{"$f":"IF(E29=\"\",\"\",IF(E29=\"WC\",\"\",IF((VLOOKUP(E29,Data!$A$11:$F$31,6,FALSE)=2),ROUND('Algemene gegevens'!F29*VLOOKUP($E29,Data!$A$11:$F$31,2,FALSE),0),\"\")))","v":""},{"$f":"IF($E29=\"\",\"\",IF((VLOOKUP($E29,Data!$A$11:$F$31,6,FALSE)=2),VLOOKUP($E29,Data!$A$11:$D$31,3,FALSE),\"\"))","v":""},{"$f":"IF($E29=\"\",\"\",IF((VLOOKUP($E29,Data!$A$11:$F$31,6,FALSE)=2),VLOOKUP($E29,Data!$A$11:$D$31,4,FALSE),\"\"))","v":""}]
[null,null,null,null,null,null,{"$f":"IF(E30=\"\",\"\",IF((VLOOKUP(E30,Data!$A$11:$F$31,6,FALSE)=1),ROUND('Algemene gegevens'!F30*VLOOKUP($E30,Data!$A$11:$F$31,2,FALSE),0),\"\"))","v":""},{"$f":"IF(E30=\"\",\"\",IF((VLOOKUP(E30,Data!$A$11:$F$31,6,FALSE)=1),VLOOKUP(E30,Data!$A$11:$D$31,3,FALSE),\"\"))","v":""},{"$f":"IF(E30=\"\",\"\",IF((VLOOKUP(E30,Data!$A$11:$F$31,6,FALSE)=1),VLOOKUP(E30,Data!$A$11:$D$31,4,FALSE),\"\"))","v":""},{"$f":"IF(E30=\"\",\"\",IF((VLOOKUP(E30,Data!$A$11:$F$31,6,FALSE)=1),IF((2*(VLOOKUP(E30,Data!$A$11:$D$31,2,FALSE)*F30))<(2*(VLOOKUP(E30,Data!$A$11:$D$31,3,FALSE))),ROUND(2*(VLOOKUP(E30,Data!$A$11:$D$31,3,FALSE)),0),ROUND(2*(VLOOKUP(E30,Data!$A$11:$D$31,2,FALSE))*F30,0)),\"\"))","v":""},{"$f":"IF(E30=\"\",\"\",IF((VLOOKUP(E30,Data!$A$11:$F$31,6,FALSE)=1),ROUND(VLOOKUP($E30,Data!$A$11:$F$31,5,FALSE),0),\"\"))","v":""},{"$f":"IF(E30=\"\",\"\",IF((VLOOKUP(E30,Data!$A$11:$F$31,6,FALSE)=2),ROUND(VLOOKUP($E30,Data!$A$11:$F$31,5,FALSE),0),\"\"))","v":""},{"$f":"IF(E30=\"\",\"\",IF(E30=\"WC\",\"\",IF((VLOOKUP(E30,Data!$A$11:$F$31,6,FALSE)=2),ROUND('Algemene gegevens'!F30*VLOOKUP($E30,Data!$A$11:$F$31,2,FALSE),0),\"\")))","v":""},{"$f":"IF($E30=\"\",\"\",IF((VLOOKUP($E30,Data!$A$11:$F$31,6,FALSE)=2),VLOOKUP($E30,Data!$A$11:$D$31,3,FALSE),\"\"))","v":""},{"$f":"IF($E30=\"\",\"\",IF((VLOOKUP($E30,Data!$A$11:$F$31,6,FALSE)=2),VLOOKUP($E30,Data!$A$11:$D$31,4,FALSE),\"\"))","v":""}]
[null,null,null,null,null,null,{"$f":"IF(E31=\"\",\"\",IF((VLOOKUP(E31,Data!$A$11:$F$31,6,FALSE)=1),ROUND('Algemene gegevens'!F31*VLOOKUP($E31,Data!$A$11:$F$31,2,FALSE),0),\"\"))","v":""},{"$f":"IF(E31=\"\",\"\",IF((VLOOKUP(E31,Data!$A$11:$F$31,6,FALSE)=1),VLOOKUP(E31,Data!$A$11:$D$31,3,FALSE),\"\"))","v":""},{"$f":"IF(E31=\"\",\"\",IF((VLOOKUP(E31,Data!$A$11:$F$31,6,FALSE)=1),VLOOKUP(E31,Data!$A$11:$D$31,4,FALSE),\"\"))","v":""},{"$f":"IF(E31=\"\",\"\",IF((VLOOKUP(E31,Data!$A$11:$F$31,6,FALSE)=1),IF((2*(VLOOKUP(E31,Data!$A$11:$D$31,2,FALSE)*F31))<(2*(VLOOKUP(E31,Data!$A$11:$D$31,3,FALSE))),ROUND(2*(VLOOKUP(E31,Data!$A$11:$D$31,3,FALSE)),0),ROUND(2*(VLOOKUP(E31,Data!$A$11:$D$31,2,FALSE))*F31,0)),\"\"))","v":""},{"$f":"IF(E31=\"\",\"\",IF((VLOOKUP(E31,Data!$A$11:$F$31,6,FALSE)=1),ROUND(VLOOKUP($E31,Data!$A$11:$F$31,5,FALSE),0),\"\"))","v":""},{"$f":"IF(E31=\"\",\"\",IF((VLOOKUP(E31,Data!$A$11:$F$31,6,FALSE)=2),ROUND(VLOOKUP($E31,Data!$A$11:$F$31,5,FALSE),0),\"\"))","v":""},{"$f":"IF(E31=\"\",\"\",IF(E31=\"WC\",\"\",IF((VLOOKUP(E31,Data!$A$11:$F$31,6,FALSE)=2),ROUND('Algemene gegevens'!F31*VLOOKUP($E31,Data!$A$11:$F$31,2,FALSE),0),\"\")))","v":""},{"$f":"IF($E31=\"\",\"\",IF((VLOOKUP($E31,Data!$A$11:$F$31,6,FALSE)=2),VLOOKUP($E31,Data!$A$11:$D$31,3,FALSE),\"\"))","v":""},{"$f":"IF($E31=\"\",\"\",IF((VLOOKUP($E31,Data!$A$11:$F$31,6,FALSE)=2),VLOOKUP($E31,Data!$A$11:$D$31,4,FALSE),\"\"))","v":""}]
[null,null,null,null,null,null,{"$f":"IF(E32=\"\",\"\",IF((VLOOKUP(E32,Data!$A$11:$F$31,6,FALSE)=1),ROUND('Algemene gegevens'!F32*VLOOKUP($E32,Data!$A$11:$F$31,2,FALSE),0),\"\"))","v":""},{"$f":"IF(E32=\"\",\"\",IF((VLOOKUP(E32,Data!$A$11:$F$31,6,FALSE)=1),VLOOKUP(E32,Data!$A$11:$D$31,3,FALSE),\"\"))","v":""},{"$f":"IF(E32=\"\",\"\",IF((VLOOKUP(E32,Data!$A$11:$F$31,6,FALSE)=1),VLOOKUP(E32,Data!$A$11:$D$31,4,FALSE),\"\"))","v":""},{"$f":"IF(E32=\"\",\"\",IF((VLOOKUP(E32,Data!$A$11:$F$31,6,FALSE)=1),IF((2*(VLOOKUP(E32,Data!$A$11:$D$31,2,FALSE)*F32))<(2*(VLOOKUP(E32,Data!$A$11:$D$31,3,FALSE))),ROUND(2*(VLOOKUP(E32,Data!$A$11:$D$31,3,FALSE)),0),ROUND(2*(VLOOKUP(E32,Data!$A$11:$D$31,2,FALSE))*F32,0)),\"\"))","v":""},{"$f":"IF(E32=\"\",\"\",IF((VLOOKUP(E32,Data!$A$11:$F$31,6,FALSE)=1),ROUND(VLOOKUP($E32,Data!$A$11:$F$31,5,FALSE),0),\"\"))","v":""},{"$f":"IF(E32=\"\",\"\",IF((VLOOKUP(E32,Data!$A$11:$F$31,6,FALSE)=2),ROUND(VLOOKUP($E32,Data!$A$11:$F$31,5,FALSE),0),\"\"))","v":""},{"$f":"IF(E32=\"\",\"\",IF(E32=\"WC\",\"\",IF((VLOOKUP(E32,Data!$A$11:$F$31,6,FALSE)=2),ROUND('Algemene gegevens'!F32*VLOOKUP($E32,Data!$A$11:$F$31,2,FALSE),0),\"\")))","v":""},{"$f":"IF($E32=\"\",\"\",IF((VLOOKUP($E32,Data!$A$11:$F$31,6,FALSE)=2),VLOOKUP($E32,Data!$A$11:$D$31,3,FALSE),\"\"))","v":""},{"$f":"IF($E32=\"\",\"\",IF((VLOOKUP($E32,Data!$A$11:$F$31,6,FALSE)=2),VLOOKUP($E32,Data!$A$11:$D$31,4,FALSE),\"\"))","v":""}]
[]
[]
[]
[]
[null,null,"Keuze ventilatiesysteem"]

{"sheet":"A","index":2,"n_rows":51,"n_cols":38,"rows_kept":51,"cut":false,"hidden":false,"merged":[[9,20,9,24],[3,4,3,8],[10,13,10,14],[10,10,10,12],[9,6,9,14],[10,6,10,9]]}
[]
[null,null,"Berekeningsblad VENTILATIE"]
[null,null,null,null,null,null,null,null,null,null,null,null,null,null,null,null,null,null,null,null,null,null,null,null,null,null,null,null,null,null,"hulptabel"]
[null,null,"Ventilatiesysteem",null,"A: natuurlijke toevoer, natuurlijke afvoer ",null,null,null,null,null,null,null,null,null,null,null,null,null,null,null,null,null,null,null,null,null,null,null,null,null,{"$f":"LOOKUP(E4,ventilatiesysteem,Data!B5:B8)","v":"A"},{"$f":"LOOKUP(E4,ventilatiesysteem,Data!C5:C8)","v":1}]
[]
[null,null,"SPECIFICATIEBLAD",null,null,null,null,null,null,null,null,null,null,null,null,null,null,null,"PRODUCTKEUZE",null,null,null,null,null,null,null,null,null,null,null,{"$f":"+O50","v":1.5}]
[]
[]
[]
[null,null,null,null,null,null,"Debiet",null,null,null,null,null,null,null,null,null,null,null,null,null,"Toevoer",null,null,null,null,"Doorstroom","Afvoer"]
[null,null,null,null,null,null,"Toevoer",null,null,null,"Doorstroom",null,null,"Afvoer",null,null,null,null,null,null,null,"dagmaat","LO","q1","ontwerpdebiet"]
[null,null,"Naam","Code","Soort ruimte","Opp","opgelegd minimum","opgelegd maximum","ontwerp","zelfregelendheid","minimum (afvoer)","minimum (toevoer)","ontwerp","opgelegd minimum","ontwerp",null,null,null,"Naam","Code",null,"(m)","(m)","(m³/h en /m)","(m³/h)",null,null,null,null,null,"actief","toevoer","doorvoer","afvoer",null,"doorvoer","zelfr","zelfr"]
[null,null,null,null,null,"(m²)","(m³/h)","(m³/h)","(m³/h)","()","(m³/h)","(m³/h)","(m³/h)","(m³/h)","(m³/h)",null,null,null,null,null,null,null,null,null,null,null,null,null,null,null,null,"controle","controle","controle",null,"minimum","actief","toevoer"]
[null,null,{"$f":"IF('Algemene gegevens'!C12=\"\",\"\",'Algemene gegevens'!C12)","v":""},{"$f":"IF('Algemene gegevens'!D12=\"\",\"\",'Algemene gegevens'!D12)","v":""},{"$f":"IF('Algemene gegevens'!E12=\"\",\"\",'Algemene gegevens'!E12)","v":""},{"$f":"IF('Algemene gegevens'!F12=\"\",\"\",'Algemene gegevens'!F12)","v":""},{"$f":"IF(E14=\"\",\"\",IF((VLOOKUP(E14,Data!$A$11:$F$31,6,FALSE)=1),IF(E14=\"\",\"\",(IF(VLOOKUP(E14,Data!$A$11:$D$31,2,FALSE)*F14<VLOOKUP(E14,Data!$A$11:$D$31,3,FALSE),ROUND(VLOOKUP(E14,Data!$A$11:$D$31,3,FALSE),0),IF(VLOOKUP(E14,Data!$A$11:$D$31,2,FALSE)*F14>VLOOKUP(E14,Data!$A$11:$D$31,4,FALSE),ROUND(VLOOKUP(E14,Data!$A$11:$D$31,4,FALSE),0),ROUND(VLOOKUP(E14,Data!$A$11:$D$31,2,FALSE)*F14,0))))),\"\"))","v":""},{"$f":"IF(E14=\"\",\"\",IF((VLOOKUP(E14,Data!$A$11:$F$31,6,FALSE)=1),IF((2*(VLOOKUP(E14,Data!$A$11:$D$31,2,FALSE)*F14))<(2*(VLOOKUP(E14,Data!$A$11:$D$31,3,FALSE))),ROUND(2*(VLOOKUP(E14,Data!$A$11:$D$31,3,FALSE)),0),ROUND(2*(VLOOKUP(E14,Data!$A$11:$D$31,2,FALSE))*F14,0)),\"\"))","v":""},null,"P0",{"$f":"IF(F14=\"\",\"\",IF((VLOOKUP(E14,Data!$A$11:$F$31,6,FALSE)=1),ROUND(VLOOKUP($E14,Data!$A$11:$F$31,5,FALSE),0),\"\"))","v":""},{"$f":"IF(F14=\"\",\"\",IF((VLOOKUP(E14,Data!$A$11:$F$31,6,FALSE)=2),ROUND(VLOOKUP($E14,Data!$A$11:$F$31,5,FALSE),0),\"\"))","v":""},null,{"$f":"IF($E14=\"\",\"\",IF((VLOOKUP($E14,Data!$A$11:$F$31,6,FALSE)=2),IF($E14=\"\",\"\",(IF(VLOOKUP($E14,Data!$A$11:$F$31,2,FALSE)*$F14<VLOOKUP($E14,Data!$A$11:$F$31,3,FALSE),VLOOKUP($E14,Data!$A$11:$F$31,3,FALSE),IF(VLOOKUP($E14,Data!$A$11:$F$31,2,FALSE)*$F14>VLOOKUP($E14,Data!$A$11:$F$31,4,FALSE),VLOOKUP($E14,Data!$A$11:$F$31,4,FALSE),ROUND(VLOOKUP($E14,Data!$A$11:$F$31,2,FALSE)*$F14,0))))),\"\"))","v":""},null,null,null,null,{"$f":"IF('Algemene gegevens'!C12=\"\",\"\",'Algemene gegevens'!C12)","v":""},{"$f":"IF('Algemene gegevens'!D12=\"\",\"\",'Algemene gegevens'!D12)","v":""},null,null,null,null,{"$f":"(V14-W14)*X14","v":0},null,null,null,null,null,{"$f":"IF(F14=\"\",0,1)","v":0},{"$f":"(IF(G14=\"\",1,IF(AND(I14<=H14,I14>=G14),1,0)))","v":1},{"$f":"(IF(AJ14=\"\",1,IF(M14>=AJ14,1,0)))","v":1},{"$f":"(IF(N14=\"\",1,IF(O14>=N14,1,0)))","v":1},null,{"$f":"IF(F14=\"\",\"\",IF((VLOOKUP(E14,Data!$A$11:$F$31,6,FALSE)=1),ROUND(VLOOKUP($E14,Data!$A$11:$F$31,5,FALSE),0),IF((VLOOKUP(E14,Data!$A$11:$F$31,6,FALSE)=2),ROUND(VLOOKUP($E14,Data!$A$11:$F$31,5,FALSE),0),\"\")))","v":""},{"$f":"IF(F14=\"\",0,IF(OR(G14<>\"\",I14<>\"\"),1,0))","v":0},{"$f":"IF($F14=\"\",\"\",IF(VLOOKUP($E14,Data!$A$11:$F$31,6,FALSE)=1,$AE14*LOOKUP(J14,zelfregelbaarheidsklasse,zelfregelbaarheidsfactor),\"\"))","v":""}]
[null,null,{"$f":"IF('Algemene gegevens'!C13=\"\",\"\",'Algemene gegevens'!C13)","v":""},{"$f":"IF('Algemene gegevens'!D13=\"\",\"\",'Algemene gegevens'!D13)","v":""},{"$f":"IF('Algemene gegevens'!E13=\"\",\"\",'Algemene gegevens'!E13)","v":""},{"$f":"IF('Algemene gegevens'!F13=\"\",\"\",'Algemene gegevens'!F13)","v":""},{"$f":"IF(E15=\"\",\"\",IF((VLOOKUP(E15,Data!$A$11:$F$31,6,FALSE)=1),IF(E15=\"\",\"\",(IF(VLOOKUP(E15,Data!$A$11:$D$31,2,FALSE)*F15<VLOOKUP(E15,Data!$A$11:$D$31,3,FALSE),ROUND(VLOOKUP(E15,Data!$A$11:$D$31,3,FALSE),0),IF(VLOOKUP(E15,Data!$A$11:$D$31,2,FALSE)*F15>VLOOKUP(E15,Data!$A$11:$D$31,4,FALSE),ROUND(VLOOKUP(E15,Data!$A$11:$D$31,4,FALSE),0),ROUND(VLOOKUP(E15,Data!$A$11:$D$31,2,FALSE)*F15,0))))),\"\"))","v":""},{"$f":"IF(E15=\"\",\"\",IF((VLOOKUP(E15,Data!$A$11:$F$31,6,FALSE)=1),IF((2*(VLOOKUP(E15,Data!$A$11:$D$31,2,FALSE)*F15))<(2*(VLOOKUP(E15,Data!$A$11:$D$31,3,FALSE))),ROUND(2*(VLOOKUP(E15,Data!$A$11:$D$31,3,FALSE)),0),ROUND(2*(VLOOKUP(E15,Data!$A$11:$D$31,2,FALSE))*F15,0)),\"\"))","v":""},null,"P3",{"$f":"IF(F15=\"\",\"\",IF((VLOOKUP(E15,Data!$A$11:$F$31,6,FALSE)=1),ROUND(VLOOKUP($E15,Data!$A$11:$F$31,5,FALSE),0),\"\"))","v":""},{"$f":"IF(F15=\"\",\"\",IF((VLOOKUP(E15,Data!$A$11:$F$31,6,FALSE)=2),ROUND(VLOOKUP($E15,Data!$A$11:$F$31,5,FALSE),0),\"\"))","v":""},null,{"$f":"IF($E15=\"\",\"\",IF((VLOOKUP($E15,Data!$A$11:$F$31,6,FALSE)=2),IF($E15=\"\",\"\",(IF(VLOOKUP($E15,Data!$A$11:$F$31,2,FALSE)*$F15<VLOOKUP($E15,Data!$A$11:$F$31,3,FALSE),VLOOKUP($E15,Data!$A$11:$F$31,3,FALSE),IF(VLOOKUP($E15,Data!$A$11:$F$31,2,FALSE)*$F15>VLOOKUP($E15,Data!$A$11:$F$31,4,FALSE),VLOOKUP($E15,Data!$A$11:$F$31,4,FALSE),ROUND(VLOOKUP($E15,Data!$A$11:$F$31,2,FALSE)*$F15,0))))),\"\"))","v":""},null,null,null,null,{"$f":"IF('Algemene gegevens'!C13=\"\",\"\",'Algemene gegevens'!C13)","v":""},{"$f":"IF('Algemene gegevens'!D13=\"\",\"\",'Algemene gegevens'!D13)","v":""},null,null,null,null,{"$f":"(V15-W15)*X15","v":0},null,null,null,null,null,0,{"$f":"(IF(G15=\"\",1,IF(AND(I15<=H15,I15>=G15),1,0)))","v":1},{"$f":"(IF(AJ15=\"\",1,IF(M15>=AJ15,1,0)))","v":1},{"$f":"(IF(N15=\"\",1,IF(O15>=N15,1,0)))","v":1},null,{"$f":"IF(F15=\"\",\"\",IF((VLOOKUP(E15,Data!$A$11:$F$31,6,FALSE)=1),ROUND(VLOOKUP($E15,Data!$A$11:$F$31,5,FALSE),0),IF((VLOOKUP(E15,Data!$A$11:$F$31,6,FALSE)=2),ROUND(VLOOKUP($E15,Data!$A$11:$F$31,5,FALSE),0),\"\")))","v":""},{"$f":"IF(F15=\"\",0,IF(OR(G15<>\"\",I15<>\"\"),1,0))","v":0},{"$f":"IF($F15=\"\",\"\",IF(VLOOKUP($E15,Data!$A$11:$F$31,6,FALSE)=1,$AE15*LOOKUP(J15,zelfregelbaarheidsklasse,zelfregelbaarheidsfactor),\"\"))","v":""}]
[null,null,{"$f":"IF('Algemene gegevens'!C14=\"\",\"\",'Algemene gegevens'!C14)","v":""},{"$f":"IF('Algemene gegevens'!D14=\"\",\"\",'Algemene gegevens'!D14)","v":""},{"$f":"IF('Algemene gegevens'!E14=\"\",\"\",'Algemene gegevens'!E14)","v":""},{"$f":"IF('Algemene gegevens'!F14=\"\",\"\",'Algemene gegevens'!F14)","v":""},{"$f":"IF(E16=\"\",\"\",IF((VLOOKUP(E16,Data!$A$11:$F$31,6,FALSE)=1),IF(E16=\"\",\"\",(IF(VLOOKUP(E16,Data!$A$11:$D$31,2,FALSE)*F16<VLOOKUP(E16,Data!$A$11:$D$31,3,FALSE),ROUND(VLOOKUP(E16,Data!$A$11:$D$31,3,FALSE),0),IF(VLOOKUP(E16,Data!$A$11:$D$31,2,FALSE)*F16>VLOOKUP(E16,Data!$A$11:$D$31,4,FALSE),ROUND(VLOOKUP(E16,Data!$A$11:$D$31,4,FALSE),0),ROUND(VLOOKUP(E16,Data!$A$11:$D$31,2,FALSE)*F16,0))))),\"\"))","v":""},{"$f":"IF(E16=\"\",\"\",IF((VLOOKUP(E16,Data!$A$11:$F$31,6,FALSE)=1),IF((2*(VLOOKUP(E16,Data!$A$11:$D$31,2,FALSE)*F16))<(2*(VLOOKUP(E16,Data!$A$11:$D$31,3,FALSE))),ROUND(2*(VLOOKUP(E16,Data!$A$11:$D$31,3,FALSE)),0),ROUND(2*(VLOOKUP(E16,Data!$A$11:$D$31,2,FALSE))*F16,0)),\"\"))","v":""},null,"P4",{"$f":"IF(F16=\"\",\"\",IF((VLOOKUP(E16,Data!$A$11:$F$31,6,FALSE)=1),ROUND(VLOOKUP($E16,Data!$A$11:$F$31,5,FALSE),0),\"\"))","v":""},{"$f":"IF(F16=\"\",\"\",IF((VLOOKUP(E16,Data!$A$11:$F$31,6,FALSE)=2),ROUND(VLOOKUP($E16,Data!$A$11:$F$31,5,FALSE),0),\"\"))","v":""},null,{"$f":"IF($E16=\"\",\"\",IF((VLOOKUP($E16,Data!$A$11:$F$31,6,FALSE)=2),IF($E16=\"\",\"\",(IF(VLOOKUP($E16,Data!$A$11:$F$31,2,FALSE)*$F16<VLOOKUP($E16,Data!$A$11:$F$31,3,FALSE),VLOOKUP($E16,Data!$A$11:$F$31,3,FALSE),IF(VLOOKUP($E16,Data!$A$11:$F$31,2,FALSE)*$F16>VLOOKUP($E16,Data!$A$11:$F$31,4,FALSE),VLOOKUP($E16,Data!$A$11:$F$31,4,FALSE),ROUND(VLOOKUP($E16,Data!$A$11:$F$31,2,FALSE)*$F16,0))))),\"\"))","v":""},null,null,null,null,{"$f":"IF('Algemene gegevens'!C14=\"\",\"\",'Algemene gegevens'!C14)","v":""},{"$f":"IF('Algemene gegevens'!D14=\"\",\"\",'Algemene gegevens'!D14)","v":""},null,null,null,null,0,null,null,null,null,null,0,1,1,1,null,{"$f":"IF(F16=\"\",\"\",IF((VLOOKUP(E16,Data!$A$11:$F$31,6,FALSE)=1),ROUND(VLOOKUP($E16,Data!$A$11:$F$31,5,FALSE),0),IF((VLOOKUP(E16,Data!$A$11:$F$31,6,FALSE)=2),ROUND(VLOOKUP($E16,Data!$A$11:$F$31,5,FALSE),0),\"\")))","v":""},0,{"$f":"IF($F16=\"\",\"\",IF(VLOOKUP($E16,Data!$A$11:$F$31,6,FALSE)=1,$AE16*LOOKUP(J16,zelfregelbaarheidsklasse,zelfregelbaarheidsfactor),\"\"))","v":""}]
[null,null,{"$f":"IF('Algemene gegevens'!C15=\"\",\"\",'Algemene gegevens'!C15)","v":""},{"$f":"IF('Algemene gegevens'!D15=\"\",\"\",'Algemene gegevens'!D15)","v":""},{"$f":"IF('Algemene gegevens'!E15=\"\",\"\",'Algemene gegevens'!E15)","v":""},{"$f":"IF('Algemene gegevens'!F15=\"\",\"\",'Algemene gegevens'!F15)","v":""},{"$f":"IF(E17=\"\",\"\",IF((VLOOKUP(E17,Data!$A$11:$F$31,6,FALSE)=1),IF(E17=\"\",\"\",(IF(VLOOKUP(E17,Data!$A$11:$D$31,2,FALSE)*F17<VLOOKUP(E17,Data!$A$11:$D$31,3,FALSE),ROUND(VLOOKUP(E17,Data!$A$11:$D$31,3,FALSE),0),IF(VLOOKUP(E17,Data!$A$11:$D$31,2,FALSE)*F17>VLOOKUP(E17,Data!$A$11:$D$31,4,FALSE),ROUND(VLOOKUP(E17,Data!$A$11:$D$31,4,FALSE),0),ROUND(VLOOKUP(E17,Data!$A$11:$D$31,2,FALSE)*F17,0))))),\"\"))","v":""},{"$f":"IF(E17=\"\",\"\",IF((VLOOKUP(E17,Data!$A$11:$F$31,6,FALSE)=1),IF((2*(VLOOKUP(E17,Data!$A$11:$D$31,2,FALSE)*F17))<(2*(VLOOKUP(E17,Data!$A$11:$D$31,3,FALSE))),ROUND(2*(VLOOKUP(E17,Data!$A$11:$D$31,3,FALSE)),0),ROUND(2*(VLOOKUP(E17,Data!$A$11:$D$31,2,FALSE))*F17,0)),\"\"))","v":""},null,"P0",{"$f":"IF(F17=\"\",\"\",IF((VLOOKUP(E17,Data!$A$11:$F$31,6,FALSE)=1),ROUND(VLOOKUP($E17,Data!$A$11:$F$31,5,FALSE),0),\"\"))","v":""},{"$f":"IF(F17=\"\",\"\",IF((VLOOKUP(E17,Data!$A$11:$F$31,6,FALSE)=2),ROUND(VLOOKUP($E17,Data!$A$11:$F$31,5,FALSE),0),\"\"))","v":""},null,{"$f":"IF($E17=\"\",\"\",IF((VLOOKUP($E17,Data!$A$11:$F$31,6,FALSE)=2),IF($E17=\"\",\"\",(IF(VLOOKUP($E17,Data!$A$11:$F$31,2,FALSE)*$F17<VLOOKUP($E17,Data!$A$11:$F$31,3,FALSE),VLOOKUP($E17,Data!$A$11:$F$31,3,FALSE),IF(VLOOKUP($E17,Data!$A$11:$F$31,2,FALSE)*$F17>VLOOKUP($E17,Data!$A$11:$F$31,4,FALSE),VLOOKUP($E17,Data!$A$11:$F$31,4,FALSE),ROUND(VLOOKUP($E17,Data!$A$11:$F$31,2,FALSE)*$F17,0))))),\"\"))","v":""},null,null,null,null,{"$f":"IF('Algemene gegevens'!C15=\"\",\"\",'Algemene gegevens'!C15)","v":""},{"$f":"IF('Algemene gegevens'!D15=\"\",\"\",'Algemene gegevens'!D15)","v":""},null,null,null,null,0,null,null,null,null,null,0,1,1,1,null,{"$f":"IF(F17=\"\",\"\",IF((VLOOKUP(E17,Data!$A$11:$F$31,6,FALSE)=1),ROUND(VLOOKUP($E17,Data!$A$11:$F$31,5,FALSE),0),IF((VLOOKUP(E17,Data!$A$11:$F$31,6,FALSE)=2),ROUND(VLOOKUP($E17,Data!$A$11:$F$31,5,FALSE),0),\"\")))","v":""},0,{"$f":"IF($F17=\"\",\"\",IF(VLOOKUP($E17,Data!$A$11:$F$31,6,FALSE)=1,$AE17*LOOKUP(J17,zelfregelbaarheidsklasse,zelfregelbaarheidsfactor),\"\"))","v":""}]
[null,null,{"$f":"IF('Algemene gegevens'!C16=\"\",\"\",'Algemene gegevens'!C16)","v":""},{"$f":"IF('Algemene gegevens'!D16=\"\",\"\",'Algemene gegevens'!D16)","v":""},{"$f":"IF('Algemene gegevens'!E16=\"\",\"\",'Algemene gegevens'!E16)","v":""},{"$f":"IF('Algemene gegevens'!F16=\"\",\"\",'Algemene gegevens'!F16)","v":""},{"$f":"IF(E18=\"\",\"\",IF((VLOOKUP(E18,Data!$A$11:$F$31,6,FALSE)=1),IF(E18=\"\",\"\",(IF(VLOOKUP(E18,Data!$A$11:$D$31,2,FALSE)*F18<VLOOKUP(E18,Data!$A$11:$D$31,3,FALSE),ROUND(VLOOKUP(E18,Data!$A$11:$D$31,3,FALSE),0),IF(VLOOKUP(E18,Data!$A$11:$D$31,2,FALSE)*F18>VLOOKUP(E18,Data!$A$11:$D$31,4,FALSE),ROUND(VLOOKUP(E18,Data!$A$11:$D$31,4,FALSE),0),ROUND(VLOOKUP(E18,Data!$A$11:$D$31,2,FALSE)*F18,0))))),\"\"))","v":""},{"$f":"IF(E18=\"\",\"\",IF((VLOOKUP(E18,Data!$A$11:$F$31,6,FALSE)=1),IF((2*(VLOOKUP(E18,Data!$A$11:$D$31,2,FALSE)*F18))<(2*(VLOOKUP(E18,Data!$A$11:$D$31,3,FALSE))),ROUND(2*(VLOOKUP(E18,Data!$A$11:$D$31,3,FALSE)),0),ROUND(2*(VLOOKUP(E18,Data!$A$11:$D$31,2,FALSE))*F18,0)),\"\"))","v":""},null,"P0",{"$f":"IF(F18=\"\",\"\",IF((VLOOKUP(E18,Data!$A$11:$F$31,6,FALSE)=1),ROUND(VLOOKUP($E18,Data!$A$11:$F$31,5,FALSE),0),\"\"))","v":""},{"$f":"IF(F18=\"\",\"\",IF((VLOOKUP(E18,Data!$A$11:$F$31,6,FALSE)=2),ROUND(VLOOKUP($E18,Data!$A$11:$F$31,5,FALSE),0),\"\"))","v":""},null,{"$f":"IF($E18=\"\",\"\",IF((VLOOKUP($E18,Data!$A$11:$F$31,6,FALSE)=2),IF($E18=\"\",\"\",(IF(VLOOKUP($E18,Data!$A$11:$F$31,2,FALSE)*$F18<VLOOKUP($E18,Data!$A$11:$F$31,3,FALSE),VLOOKUP($E18,Data!$A$11:$F$31,3,FALSE),IF(VLOOKUP($E18,Data!$A$11:$F$31,2,FALSE)*$F18>VLOOKUP($E18,Data!$A$11:$F$31,4,FALSE),VLOOKUP($E18,Data!$A$11:$F$31,4,FALSE),ROUND(VLOOKUP($E18,Data!$A$11:$F$31,2,FALSE)*$F18,0))))),\"\"))","v":""},null,null,null,null,{"$f":"IF('Algemene gegevens'!C16=\"\",\"\",'Algemene gegevens'!C16)","v":""},{"$f":"IF('Algemene gegevens'!D16=\"\",\"\",'Algemene gegevens'!D16)","v":""},null,null,null,null,0,null,null,null,null,null,0,1,1,1,null,{"$f":"IF(F18=\"\",\"\",IF((VLOOKUP(E18,Data!$A$11:$F$31,6,FALSE)=1),ROUND(VLOOKUP($E18,Data!$A$11:$F$31,5,FALSE),0),IF((VLOOKUP(E18,Data!$A$11:$F$31,6,FALSE)=2),ROUND(VLOOKUP($E18,Data!$A$11:$F$31,5,FALSE),0),\"\")))","v":""},0,{"$f":"IF($F18=\"\",\"\",IF(VLOOKUP($E18,Data!$A$11:$F$31,6,FALSE)=1,$AE18*LOOKUP(J18,zelfregelbaarheidsklasse,zelfregelbaarheidsfactor),\"\"))","v":""}]
[null,null,{"$f":"IF('Algemene gegevens'!C17=\"\",\"\",'Algemene gegevens'!C17)","v":""},{"$f":"IF('Algemene gegevens'!D17=\"\",\"\",'Algemene gegevens'!D17)","v":""},{"$f":"IF('Algemene gegevens'!E17=\"\",\"\",'Algemene gegevens'!E17)","v":""},{"$f":"IF('Algemene gegevens'!F17=\"\",\"\",'Algemene gegevens'!F17)","v":""},{"$f":"IF(E19=\"\",\"\",IF((VLOOKUP(E19,Data!$A$11:$F$31,6,FALSE)=1),IF(E19=\"\",\"\",(IF(VLOOKUP(E19,Data!$A$11:$D$31,2,FALSE)*F19<VLOOKUP(E19,Data!$A$11:$D$31,3,FALSE),ROUND(VLOOKUP(E19,Data!$A$11:$D$31,3,FALSE),0),IF(VLOOKUP(E19,Data!$A$11:$D$31,2,FALSE)*F19>VLOOKUP(E19,Data!$A$11:$D$31,4,FALSE),ROUND(VLOOKUP(E19,Data!$A$11:$D$31,4,FALSE),0),ROUND(VLOOKUP(E19,Data!$A$11:$D$31,2,FALSE)*F19,0))))),\"\"))","v":""},{"$f":"IF(E19=\"\",\"\",IF((VLOOKUP(E19,Data!$A$11:$F$31,6,FALSE)=1),IF((2*(VLOOKUP(E19,Data!$A$11:$D$31,2,FALSE)*F19))<(2*(VLOOKUP(E19,Data!$A$11:$D$31,3,FALSE))),ROUND(2*(VLOOKUP(E19,Data!$A$11:$D$31,3,FALSE)),0),ROUND(2*(VLOOKUP(E19,Data!$A$11:$D$31,2,FALSE))*F19,0)),\"\"))","v":""},null,"P0",{"$f":"IF(F19=\"\",\"\",IF((VLOOKUP(E19,Data!$A$11:$F$31,6,FALSE)=1),ROUND(VLOOKUP($E19,Data!$A$11:$F$31,5,FALSE),0),\"\"))","v":""},{"$f":"IF(F19=\"\",\"\",IF((VLOOKUP(E19,Data!$A$11:$F$31,6,FALSE)=2),ROUND(VLOOKUP($E19,Data!$A$11:$F$31,5,FALSE),0),\"\"))","v":""},null,{"$f":"IF($E19=\"\",\"\",IF((VLOOKUP($E19,Data!$A$11:$F$31,6,FALSE)=2),IF($E19=\"\",\"\",(IF(VLOOKUP($E19,Data!$A$11:$F$31,2,FALSE)*$F19<VLOOKUP($E19,Data!$A$11:$F$31,3,FALSE),VLOOKUP($E19,Data!$A$11:$F$31,3,FALSE),IF(VLOOKUP($E19,Data!$A$11:$F$31,2,FALSE)*$F19>VLOOKUP($E19,Data!$A$11:$F$31,4,FALSE),VLOOKUP($E19,Data!$A$11:$F$31,4,FALSE),ROUND(VLOOKUP($E19,Data!$A$11:$F$31,2,FALSE)*$F19,0))))),\"\"))","v":""},null,null,null,null,{"$f":"IF('Algemene gegevens'!C17=\"\",\"\",'Algemene gegevens'!C17)","v":""},{"$f":"IF('Algemene gegevens'!D17=\"\",\"\",'Algemene gegevens'!D17)","v":""},null,null,null,null,0,null,null,null,null,null,0,1,1,1,null,{"$f":"IF(F19=\"\",\"\",IF((VLOOKUP(E19,Data!$A$11:$F$31,6,FALSE)=1),ROUND(VLOOKUP($E19,Data!$A$11:$F$31,5,FALSE),0),IF((VLOOKUP(E19,Data!$A$11:$F$31,6,FALSE)=2),ROUND(VLOOKUP($E19,Data!$A$11:$F$31,5,FALSE),0),\"\")))","v":""},0,{"$f":"IF($F19=\"\",\"\",IF(VLOOKUP($E19,Data!$A$11:$F$31,6,FALSE)=1,$AE19*LOOKUP(J19,zelfregelbaarheidsklasse,zelfregelbaarheidsfactor),\"\"))","v":""}]
[null,null,{"$f":"IF('Algemene gegevens'!C18=\"\",\"\",'Algemene gegevens'!C18)","v":""},{"$f":"IF('Algemene gegevens'!D18=\"\",\"\",'Algemene gegevens'!D18)","v":""},{"$f":"IF('Algemene gegevens'!E18=\"\",\"\",'Algemene gegevens'!E18)","v":""},{"$f":"IF('Algemene gegevens'!F18=\"\",\"\",'Algemene gegevens'!F18)","v":""},{"$f":"IF(E20=\"\",\"\",IF((VLOOKUP(E20,Data!$A$11:$F$31,6,FALSE)=1),IF(E20=\"\",\"\",(IF(VLOOKUP(E20,Data!$A$11:$D$31,2,FALSE)*F20<VLOOKUP(E20,Data!$A$11:$D$31,3,FALSE),ROUND(VLOOKUP(E20,Data!$A$11:$D$31,3,FALSE),0),IF(VLOOKUP(E20,Data!$A$11:$D$31,2,FALSE)*F20>VLOOKUP(E20,Data!$A$11:$D$31,4,FALSE),ROUND(VLOOKUP(E20,Data!$A$11:$D$31,4,FALSE),0),ROUND(VLOOKUP(E20,Data!$A$11:$D$31,2,FALSE)*F20,0))))),\"\"))","v":""},{"$f":"IF(E20=\"\",\"\",IF((VLOOKUP(E20,Data!$A$11:$F$31,6,FALSE)=1),IF((2*(VLOOKUP(E20,Data!$A$11:$D$31,2,FALSE)*F20))<(2*(VLOOKUP(E20,Data!$A$11:$D$31,3,FALSE))),ROUND(2*(VLOOKUP(E20,Data!$A$11:$D$31,3,FALSE)),0),ROUND(2*(VLOOKUP(E20,Data!$A$11:$D$31,2,FALSE))*F20,0)),\"\"))","v":""},null,"P4",{"$f":"IF(F20=\"\",\"\",IF((VLOOKUP(E20,Data!$A$11:$F$31,6,FALSE)=1),ROUND(VLOOKUP($E20,Data!$A$11:$F$31,5,FALSE),0),\"\"))","v":""},{"$f":"IF(F20=\"\",\"\",IF((VLOOKUP(E20,Data!$A$11:$F$31,6,FALSE)=2),ROUND(VLOOKUP($E20,Data!$A$11:$F$31,5,FALSE),0),\"\"))","v":""},null,{"$f":"IF($E20=\"\",\"\",IF((VLOOKUP($E20,Data!$A$11:$F$31,6,FALSE)=2),IF($E20=\"\",\"\",(IF(VLOOKUP($E20,Data!$A$11:$F$31,2,FALSE)*$F20<VLOOKUP($E20,Data!$A$11:$F$31,3,FALSE),VLOOKUP($E20,Data!$A$11:$F$31,3,FALSE),IF(VLOOKUP($E20,Data!$A$11:$F$31,2,FALSE)*$F20>VLOOKUP($E20,Data!$A$11:$F$31,4,FALSE),VLOOKUP($E20,Data!$A$11:$F$31,4,FALSE),ROUND(VLOOKUP($E20,Data!$A$11:$F$31,2,FALSE)*$F20,0))))),\"\"))","v":""},null,null,null,null,{"$f":"IF('Algemene gegevens'!C18=\"\",\"\",'Algemene gegevens'!C18)","v":""},{"$f":"IF('Algemene gegevens'!D18=\"\",\"\",'Algemene gegevens'!D18)","v":""},null,null,null,null,0,null,null,null,null,null,0,1,1,1,null,{"$f":"IF(F20=\"\",\"\",IF((VLOOKUP(E20,Data!$A$11:$F$31,6,FALSE)=1),ROUND(VLOOKUP($E20,Data!$A$11:$F$31,5,FALSE),0),IF((VLOOKUP(E20,Data!$A$11:$F$31,6,FALSE)=2),ROUND(VLOOKUP($E20,Data!$A$11:$F$31,5,FALSE),0),\"\")))","v":""},0,{"$f":"IF($F20=\"\",\"\",IF(VLOOKUP($E20,Data!$A$11:$F$31,6,FALSE)=1,$AE20*LOOKUP(J20,zelfregelbaarheidsklasse,zelfregelbaarheidsfactor),\"\"))","v":""}]
[null,null,{"$f":"IF('Algemene gegevens'!C19=\"\",\"\",'Algemene gegevens'!C19)","v":""},{"$f":"IF('Algemene gegevens'!D19=\"\",\"\",'Algemene gegevens'!D19)","v":""},{"$f":"IF('Algemene gegevens'!E19=\"\",\"\",'Algemene gegevens'!E19)","v":""},{"$f":"IF('Algemene gegevens'!F19=\"\",\"\",'Algemene gegevens'!F19)","v":""},{"$f":"IF(E21=\"\",\"\",IF((VLOOKUP(E21,Data!$A$11:$F$31,6,FALSE)=1),IF(E21=\"\",\"\",(IF(VLOOKUP(E21,Data!$A$11:$D$31,2,FALSE)*F21<VLOOKUP(E21,Data!$A$11:$D$31,3,FALSE),ROUND(VLOOKUP(E21,Data!$A$11:$D$31,3,FALSE),0),IF(VLOOKUP(E21,Data!$A$11:$D$31,2,FALSE)*F21>VLOOKUP(E21,Data!$A$11:$D$31,4,FALSE),ROUND(VLOOKUP(E21,Data!$A$11:$D$31,4,FALSE),0),ROUND(VLOOKUP(E21,Data!$A$11:$D$31,2,FALSE)*F21,0))))),\"\"))","v":""},{"$f":"IF(E21=\"\",\"\",IF((VLOOKUP(E21,Data!$A$11:$F$31,6,FALSE)=1),IF((2*(VLOOKUP(E21,Data!$A$11:$D$31,2,FALSE)*F21))<(2*(VLOOKUP(E21,Data!$A$11:$D$31,3,FALSE))),ROUND(2*(VLOOKUP(E21,Data!$A$11:$D$31,3,FALSE)),0),ROUND(2*(VLOOKUP(E21,Data!$A$11:$D$31,2,FALSE))*F21,0)),\"\"))","v":""},null,"P4",{"$f":"IF(F21=\"\",\"\",IF((VLOOKUP(E21,Data!$A$11:$F$31,6,FALSE)=1),ROUND(VLOOKUP($E21,Data!$A$11:$F$31,5,FALSE),0),\"\"))","v":""},{"$f":"IF(F21=\"\",\"\",IF((VLOOKUP(E21,Data!$A$11:$F$31,6,FALSE)=2),ROUND(VLOOKUP($E21,Data!$A$11:$F$31,5,FALSE),0),\"\"))","v":""},null,{"$f":"IF($E21=\"\",\"\",IF((VLOOKUP($E21,Data!$A$11:$F$31,6,FALSE)=2),IF($E21=\"\",\"\",(IF(VLOOKUP($E21,Data!$A$11:$F$31,2,FALSE)*$F21<VLOOKUP($E21,Data!$A$11:$F$31,3,FALSE),VLOOKUP($E21,Data!$A$11:$F$31,3,FALSE),IF(VLOOKUP($E21,Data!$A$11:$F$31,2,FALSE)*$F21>VLOOKUP($E21,Data!$A$11:$F$31,4,FALSE),VLOOKUP($E21,Data!$A$11:$F$31,4,FALSE),ROUND(VLOOKUP($E21,Data!$A$11:$F$31,2,FALSE)*$F21,0))))),\"\"))","v":""},null,null,null,null,{"$f":"IF('Algemene gegevens'!C19=\"\",\"\",'Algemene gegevens'!C19)","v":""},{"$f":"IF('Algemene gegevens'!D19=\"\",\"\",'Algemene gegevens'!D19)","v":""},null,null,null,null,0,null,null,null,null,null,0,1,1,1,null,{"$f":"IF(F21=\"\",\"\",IF((VLOOKUP(E21,Data!$A$11:$F$31,6,FALSE)=1),ROUND(VLOOKUP($E21,Data!$A$11:$F$31,5,FALSE),0),IF((VLOOKUP(E21,Data!$A$11:$F$31,6,FALSE)=2),ROUND(VLOOKUP($E21,Data!$A$11:$F$31,5,FALSE),0),\"\")))","v":""},0,{"$f":"IF($F21=\"\",\"\",IF(VLOOKUP($E21,Data!$A$11:$F$31,6,FALSE)=1,$AE21*LOOKUP(J21,zelfregelbaarheidsklasse,zelfregelbaarheidsfactor),\"\"))","v":""}]
[null,null,{"$f":"IF('Algemene gegevens'!C20=\"\",\"\",'Algemene gegevens'!C20)","v":""},{"$f":"IF('Algemene gegevens'!D20=\"\",\"\",'Algemene gegevens'!D20)","v":""},{"$f":"IF('Algemene gegevens'!E20=\"\",\"\",'Algemene gegevens'!E20)","v":""},{"$f":"IF('Algemene gegevens'!F20=\"\",\"\",'Algemene gegevens'!F20)","v":""},{"$f":"IF(E22=\"\",\"\",IF((VLOOKUP(E22,Data!$A$11:$F$31,6,FALSE)=1),IF(E22=\"\",\"\",(IF(VLOOKUP(E22,Data!$A$11:$D$31,2,FALSE)*F22<VLOOKUP(E22,Data!$A$11:$D$31,3,FALSE),ROUND(VLOOKUP(E22,Data!$A$11:$D$31,3,FALSE),0),IF(VLOOKUP(E22,Data!$A$11:$D$31,2,FALSE)*F22>VLOOKUP(E22,Data!$A$11:$D$31,4,FALSE),ROUND(VLOOKUP(E22,Data!$A$11:$D$31,4,FALSE),0),ROUND(VLOOKUP(E22,Data!$A$11:$D$31,2,FALSE)*F22,0))))),\"\"))","v":""},{"$f":"IF(E22=\"\",\"\",IF((VLOOKUP(E22,Data!$A$11:$F$31,6,FALSE)=1),IF((2*(VLOOKUP(E22,Data!$A$11:$D$31,2,FALSE)*F22))<(2*(VLOOKUP(E22,Data!$A$11:$D$31,3,FALSE))),ROUND(2*(VLOOKUP(E22,Data!$A$11:$D$31,3,FALSE)),0),ROUND(2*(VLOOKUP(E22,Data!$A$11:$D$31,2,FALSE))*F22,0)),\"\"))","v":""},null,"P3",{"$f":"IF(F22=\"\",\"\",IF((VLOOKUP(E22,Data!$A$11:$F$31,6,FALSE)=1),ROUND(VLOOKUP($E22,Data!$A$11:$F$31,5,FALSE),0),\"\"))","v":""},{"$f":"IF(F22=\"\",\"\",IF((VLOOKUP(E22,Data!$A$11:$F$31,6,FALSE)=2),ROUND(VLOOKUP($E22,Data!$A$11:$F$31,5,FALSE),0),\"\"))","v":""},null,{"$f":"IF($E22=\"\",\"\",IF((VLOOKUP($E22,Data!$A$11:$F$31,6,FALSE)=2),IF($E22=\"\",\"\",(IF(VLOOKUP($E22,Data!$A$11:$F$31,2,FALSE)*$F22<VLOOKUP($E22,Data!$A$11:$F$31,3,FALSE),VLOOKUP($E22,Data!$A$11:$F$31,3,FALSE),IF(VLOOKUP($E22,Data!$A$11:$F$31,2,FALSE)*$F22>VLOOKUP($E22,Data!$A$11:$F$31,4,FALSE),VLOOKUP($E22,Data!$A$11:$F$31,4,FALSE),ROUND(VLOOKUP($E22,Data!$A$11:$F$31,2,FALSE)*$F22,0))))),\"\"))","v":""},null,null,null,null,{"$f":"IF('Algemene gegevens'!C20=\"\",\"\",'Algemene gegevens'!C20)","v":""},{"$f":"IF('Algemene gegevens'!D20=\"\",\"\",'Algemene gegevens'!D20)","v":""},null,null,null,null,0,null,null,null,null,null,0,1,1,1,null,{"$f":"IF(F22=\"\",\"\",IF((VLOOKUP(E22,Data!$A$11:$F$31,6,FALSE)=1),ROUND(VLOOKUP($E22,Data!$A$11:$F$31,5,FALSE),0),IF((VLOOKUP(E22,Data!$A$11:$F$31,6,FALSE)=2),ROUND(VLOOKUP($E22,Data!$A$11:$F$31,5,FALSE),0),\"\")))","v":""},0,{"$f":"IF($F22=\"\",\"\",IF(VLOOKUP($E22,Data!$A$11:$F$31,6,FALSE)=1,$AE22*LOOKUP(J22,zelfregelbaarheidsklasse,zelfregelbaarheidsfactor),\"\"))","v":""}]
[null,null,{"$f":"IF('Algemene gegevens'!C21=\"\",\"\",'Algemene gegevens'!C21)","v":""},{"$f":"IF('Algemene gegevens'!D21=\"\",\"\",'Algemene gegevens'!D21)","v":""},{"$f":"IF('Algemene gegevens'!E21=\"\",\"\",'Algemene gegevens'!E21)","v":""},{"$f":"IF('Algemene gegevens'!F21=\"\",\"\",'Algemene gegevens'!F21)","v":""},{"$f":"IF(E23=\"\",\"\",IF((VLOOKUP(E23,Data!$A$11:$F$31,6,FALSE)=1),IF(E23=\"\",\"\",(IF(VLOOKUP(E23,Data!$A$11:$D$31,2,FALSE)*F23<VLOOKUP(E23,Data!$A$11:$D$31,3,FALSE),ROUND(VLOOKUP(E23,Data!$A$11:$D$31,3,FALSE),0),IF(VLOOKUP(E23,Data!$A$11:$D$31,2,FALSE)*F23>VLOOKUP(E23,Data!$A$11:$D$31,4,FALSE),ROUND(VLOOKUP(E23,Data!$A$11:$D$31,4,FALSE),0),ROUND(VLOOKUP(E23,Data!$A$11:$D$31,2,FALSE)*F23,0))))),\"\"))","v":""},{"$f":"IF(E23=\"\",\"\",IF((VLOOKUP(E23,Data!$A$11:$F$31,6,FALSE)=1),IF((2*(VLOOKUP(E23,Data!$A$11:$D$31,2,FALSE)*F23))<(2*(VLOOKUP(E23,Data!$A$11:$D$31,3,FALSE))),ROUND(2*(VLOOKUP(E23,Data!$A$11:$D$31,3,FALSE)),0),ROUND(2*(VLOOKUP(E23,Data!$A$11:$D$31,2,FALSE))*F23,0)),\"\"))","v":""},null,"P3",{"$f":"IF(F23=\"\",\"\",IF((VLOOKUP(E23,Data!$A$11:$F$31,6,FALSE)=1),ROUND(VLOOKUP($E23,Data!$A$11:$F$31,5,FALSE),0),\"\"))","v":""},{"$f":"IF(F23=\"\",\"\",IF((VLOOKUP(E23,Data!$A$11:$F$31,6,FALSE)=2),ROUND(VLOOKUP($E23,Data!$A$11:$F$31,5,FALSE),0),\"\"))","v":""},null,{"$f":"IF($E23=\"\",\"\",IF((VLOOKUP($E23,Data!$A$11:$F$31,6,FALSE)=2),IF($E23=\"\",\"\",(IF(VLOOKUP($E23,Data!$A$11:$F$31,2,FALSE)*$F23<VLOOKUP($E23,Data!$A$11:$F$31,3,FALSE),VLOOKUP($E23,Data!$A$11:$F$31,3,FALSE),IF(VLOOKUP($E23,Data!$A$11:$F$31,2,FALSE)*$F23>VLOOKUP($E23,Data!$A$11:$F$31,4,FALSE),VLOOKUP($E23,Data!$A$11:$F$31,4,FALSE),ROUND(VLOOKUP($E23,Data!$A$11:$F$31,2,FALSE)*$F23,0))))),\"\"))","v":""},null,null,null,null,{"$f":"IF('Algemene gegevens'!C21=\"\",\"\",'Algemene gegevens'!C21)","v":""},{"$f":"IF('Algemene gegevens'!D21=\"\",\"\",'Algemene gegevens'!D21)","v":""},null,null,null,null,0,null,null,null,null,null,0,1,1,1,null,{"$f":"IF(F23=\"\",\"\",IF((VLOOKUP(E23,Data!$A$11:$F$31,6,FALSE)=1),ROUND(VLOOKUP($E23,Data!$A$11:$F$31,5,FALSE),0),IF((VLOOKUP(E23,Data!$A$11:$F$31,6,FALSE)=2),ROUND(VLOOKUP($E23,Data!$A$11:$F$31,5,FALSE),0),\"\")))","v":""},0,{"$f":"IF($F23=\"\",\"\",IF(VLOOKUP($E23,Data!$A$11:$F$31,6,FALSE)=1,$AE23*LOOKUP(J23,zelfregelbaarheidsklasse,zelfregelbaarheidsfactor),\"\"))","v":""}]
[null,null,{"$f":"IF('Algemene gegevens'!C22=\"\",\"\",'Algemene gegevens'!C22)","v":""},{"$f":"IF('Algemene gegevens'!D22=\"\",\"\",'Algemene gegevens'!D22)","v":""},{"$f":"IF('Algemene gegevens'!E22=\"\",\"\",'Algemene gegevens'!E22)","v":""},{"$f":"IF('Algemene gegevens'!F22=\"\",\"\",'Algemene gegevens'!F22)","v":""},{"$f":"IF(E24=\"\",\"\",IF((VLOOKUP(E24,Data!$A$11:$F$31,6,FALSE)=1),IF(E24=\"\",\"\",(IF(VLOOKUP(E24,Data!$A$11:$D$31,2,FALSE)*F24<VLOOKUP(E24,Data!$A$11:$D$31,3,FALSE),ROUND(VLOOKUP(E24,Data!$A$11:$D$31,3,FALSE),0),IF(VLOOKUP(E24,Data!$A$11:$D$31,2,FALSE)*F24>VLOOKUP(E24,Data!$A$11:$D$31,4,FALSE),ROUND(VLOOKUP(E24,Data!$A$11:$D$31,4,FALSE),0),ROUND(VLOOKUP(E24,Data!$A$11:$D$31,2,FALSE)*F24,0))))),\"\"))","v":""},{"$f":"IF(E24=\"\",\"\",IF((VLOOKUP(E24,Data!$A$11:$F$31,6,FALSE)=1),IF((2*(VLOOKUP(E24,Data!$A$11:$D$31,2,FALSE)*F24))<(2*(VLOOKUP(E24,Data!$A$11:$D$31,3,FALSE))),ROUND(2*(VLOOKUP(E24,Data!$A$11:$D$31,3,FALSE)),0),ROUND(2*(VLOOKUP(E24,Data!$A$11:$D$31,2,FALSE))*F24,0)),\"\"))","v":""},null,"P4",{"$f":"IF(F24=\"\",\"\",IF((VLOOKUP(E24,Data!$A$11:$F$31,6,FALSE)=1),ROUND(VLOOKUP($E24,Data!$A$11:$F$31,5,FALSE),0),\"\"))","v":""},{"$f":"IF(F24=\"\",\"\",IF((VLOOKUP(E24,Data!$A$11:$F$31,6,FALSE)=2),ROUND(VLOOKUP($E24,Data!$A$11:$F$31,5,FALSE),0),\"\"))","v":""},null,{"$f":"IF($E24=\"\",\"\",IF((VLOOKUP($E24,Data!$A$11:$F$31,6,FALSE)=2),IF($E24=\"\",\"\",(IF(VLOOKUP($E24,Data!$A$11:$F$31,2,FALSE)*$F24<VLOOKUP($E24,Data!$A$11:$F$31,3,FALSE),VLOOKUP($E24,Data!$A$11:$F$31,3,FALSE),IF(VLOOKUP($E24,Data!$A$11:$F$31,2,FALSE)*$F24>VLOOKUP($E24,Data!$A$11:$F$31,4,FALSE),VLOOKUP($E24,Data!$A$11:$F$31,4,FALSE),ROUND(VLOOKUP($E24,Data!$A$11:$F$31,2,FALSE)*$F24,0))))),\"\"))","v":""},null,null,null,null,{"$f":"IF('Algemene gegevens'!C22=\"\",\"\",'Algemene gegevens'!C22)","v":""},{"$f":"IF('Algemene gegevens'!D22=\"\",\"\",'Algemene gegevens'!D22)","v":""},null,null,null,null,0,null,null,null,null,null,0,1,1,1,null,{"$f":"IF(F24=\"\",\"\",IF((VLOOKUP(E24,Data!$A$11:$F$31,6,FALSE)=1),ROUND(VLOOKUP($E24,Data!$A$11:$F$31,5,FALSE),0),IF((VLOOKUP(E24,Data!$A$11:$F$31,6,FALSE)=2),ROUND(VLOOKUP($E24,Data!$A$11:$F$31,5,FALSE),0),\"\")))","v":""},0,{"$f":"IF($F24=\"\",\"\",IF(VLOOKUP($E24,Data!$A$11:$F$31,6,FALSE)=1,$AE24*LOOKUP(J24,zelfregelbaarheidsklasse,zelfregelbaarheidsfactor),\"\"))","v":""}]
[null,null,{"$f":"IF('Algemene gegevens'!C23=\"\",\"\",'Algemene gegevens'!C23)","v":""},{"$f":"IF('Algemene gegevens'!D23=\"\",\"\",'Algemene gegevens'!D23)","v":""},{"$f":"IF('Algemene gegevens'!E23=\"\",\"\",'Algemene gegevens'!E23)","v":""},{"$f":"IF('Algemene gegevens'!F23=\"\",\"\",'Algemene gegevens'!F23)","v":""},{"$f":"IF(E25=\"\",\"\",IF((VLOOKUP(E25,Data!$A$11:$F$31,6,FALSE)=1),IF(E25=\"\",\"\",(IF(VLOOKUP(E25,Data!$A$11:$D$31,2,FALSE)*F25<VLOOKUP(E25,Data!$A$11:$D$31,3,FALSE),ROUND(VLOOKUP(E25,Data!$A$11:$D$31,3,FALSE),0),IF(VLOOKUP(E25,Data!$A$11:$D$31,2,FALSE)*F25>VLOOKUP(E25,Data!$A$11:$D$31,4,FALSE),ROUND(VLOOKUP(E25,Data!$A$11:$D$31,4,FALSE),0),ROUND(VLOOKUP(E25,Data!$A$11:$D$31,2,FALSE)*F25,0))))),\"\"))","v":""},{"$f":"IF(E25=\"\",\"\",IF((VLOOKUP(E25,Data!$A$11:$F$31,6,FALSE)=1),IF((2*(VLOOKUP(E25,Data!$A$11:$D$31,2,FALSE)*F25))<(2*(VLOOKUP(E25,Data!$A$11:$D$31,3,FALSE))),ROUND(2*(VLOOKUP(E25,Data!$A$11:$D$31,3,FALSE)),0),ROUND(2*(VLOOKUP(E25,Data!$A$11:$D$31,2,FALSE))*F25,0)),\"\"))","v":""},null,"P4",{"$f":"IF(F25=\"\",\"\",IF((VLOOKUP(E25,Data!$A$11:$F$31,6,FALSE)=1),ROUND(VLOOKUP($E25,Data!$A$11:$F$31,5,FALSE),0),\"\"))","v":""},{"$f":"IF(F25=\"\",\"\",IF((VLOOKUP(E25,Data!$A$11:$F$31,6,FALSE)=2),ROUND(VLOOKUP($E25,Data!$A$11:$F$31,5,FALSE),0),\"\"))","v":""},null,{"$f":"IF($E25=\"\",\"\",IF((VLOOKUP($E25,Data!$A$11:$F$31,6,FALSE)=2),IF($E25=\"\",\"\",(IF(VLOOKUP($E25,Data!$A$11:$F$31,2,FALSE)*$F25<VLOOKUP($E25,Data!$A$11:$F$31,3,FALSE),VLOOKUP($E25,Data!$A$11:$F$31,3,FALSE),IF(VLOOKUP($E25,Data!$A$11:$F$31,2,FALSE)*$F25>VLOOKUP($E25,Data!$A$11:$F$31,4,FALSE),VLOOKUP($E25,Data!$A$11:$F$31,4,FALSE),ROUND(VLOOKUP($E25,Data!$A$11:$F$31,2,FALSE)*$F25,0))))),\"\"))","v":""},null,null,null,null,{"$f":"IF('Algemene gegevens'!C23=\"\",\"\",'Algemene gegevens'!C23)","v":""},{"$f":"IF('Algemene gegevens'!D23=\"\",\"\",'Algemene gegevens'!D23)","v":""},null,null,null,null,0,null,null,null,null,null,0,1,1,1,null,{"$f":"IF(F25=\"\",\"\",IF((VLOOKUP(E25,Data!$A$11:$F$31,6,FALSE)=1),ROUND(VLOOKUP($E25,Data!$A$11:$F$31,5,FALSE),0),IF((VLOOKUP(E25,Data!$A$11:$F$31,6,FALSE)=2),ROUND(VLOOKUP($E25,Data!$A$11:$F$31,5,FALSE),0),\"\")))","v":""},0,{"$f":"IF($F25=\"\",\"\",IF(VLOOKUP($E25,Data!$A$11:$F$31,6,FALSE)=1,$AE25*LOOKUP(J25,zelfregelbaarheidsklasse,zelfregelbaarheidsfactor),\"\"))","v":""}]
[null,null,{"$f":"IF('Algemene gegevens'!C24=\"\",\"\",'Algemene gegevens'!C24)","v":""},{"$f":"IF('Algemene gegevens'!D24=\"\",\"\",'Algemene gegevens'!D24)","v":""},{"$f":"IF('Algemene gegevens'!E24=\"\",\"\",'Algemene gegevens'!E24)","v":""},{"$f":"IF('Algemene gegevens'!F24=\"\",\"\",'Algemene gegevens'!F24)","v":""},{"$f":"IF(E26=\"\",\"\",IF((VLOOKUP(E26,Data!$A$11:$F$31,6,FALSE)=1),IF(E26=\"\",\"\",(IF(VLOOKUP(E26,Data!$A$11:$D$31,2,FALSE)*F26<VLOOKUP(E26,Data!$A$11:$D$31,3,FALSE),ROUND(VLOOKUP(E26,Data!$A$11:$D$31,3,FALSE),0),IF(VLOOKUP(E26,Data!$A$11:$D$31,2,FALSE)*F26>VLOOKUP(E26,Data!$A$11:$D$31,4,FALSE),ROUND(VLOOKUP(E26,Data!$A$11:$D$31,4,FALSE),0),ROUND(VLOOKUP(E26,Data!$A$11:$D$31,2,FALSE)*F26,0))))),\"\"))","v":""},{"$f":"IF(E26=\"\",\"\",IF((VLOOKUP(E26,Data!$A$11:$F$31,6,FALSE)=1),IF((2*(VLOOKUP(E26,Data!$A$11:$D$31,2,FALSE)*F26))<(2*(VLOOKUP(E26,Data!$A$11:$D$31,3,FALSE))),ROUND(2*(VLOOKUP(E26,Data!$A$11:$D$31,3,FALSE)),0),ROUND(2*(VLOOKUP(E26,Data!$A$11:$D$31,2,FALSE))*F26,0)),\"\"))","v":""},null,"P0",{"$f":"IF(F26=\"\",\"\",IF((VLOOKUP(E26,Data!$A$11:$F$31,6,FALSE)=1),ROUND(VLOOKUP($E26,Data!$A$11:$F$31,5,FALSE),0),\"\"))","v":""},{"$f":"IF(F26=\"\",\"\",IF((VLOOKUP(E26,Data!$A$11:$F$31,6,FALSE)=2),ROUND(VLOOKUP($E26,Data!$A$11:$F$31,5,FALSE),0),\"\"))","v":""},null,{"$f":"IF($E26=\"\",\"\",IF((VLOOKUP($E26,Data!$A$11:$F$31,6,FALSE)=2),IF($E26=\"\",\"\",(IF(VLOOKUP($E26,Data!$A$11:$F$31,2,FALSE)*$F26<VLOOKUP($E26,Data!$A$11:$F$31,3,FALSE),VLOOKUP($E26,Data!$A$11:$F$31,3,FALSE),IF(VLOOKUP($E26,Data!$A$11:$F$31,2,FALSE)*$F26>VLOOKUP($E26,Data!$A$11:$F$31,4,FALSE),VLOOKUP($E26,Data!$A$11:$F$31,4,FALSE),ROUND(VLOOKUP($E26,Data!$A$11:$F$31,2,FALSE)*$F26,0))))),\"\"))","v":""},null,null,null,null,{"$f":"IF('Algemene gegevens'!C24=\"\",\"\",'Algemene gegevens'!C24)","v":""},{"$f":"IF('Algemene gegevens'!D24=\"\",\"\",'Algemene gegevens'!D24)","v":""},null,null,null,null,0,null,null,null,null,null,0,1,1,1,null,{"$f":"IF(F26=\"\",\"\",IF((VLOOKUP(E26,Data!$A$11:$F$31,6,FALSE)=1),ROUND(VLOOKUP($E26,Data!$A$11:$F$31,5,FALSE),0),IF((VLOOKUP(E26,Data!$A$11:$F$31,6,FALSE)=2),ROUND(VLOOKUP($E26,Data!$A$11:$F$31,5,FALSE),0),\"\")))","v":""},0,{"$f":"IF($F26=\"\",\"\",IF(VLOOKUP($E26,Data!$A$11:$F$31,6,FALSE)=1,$AE26*LOOKUP(J26,zelfregelbaarheidsklasse,zelfregelbaarheidsfactor),\"\"))","v":""}]
[null,null,{"$f":"IF('Algemene gegevens'!C25=\"\",\"\",'Algemene gegevens'!C25)","v":""},{"$f":"IF('Algemene gegevens'!D25=\"\",\"\",'Algemene gegevens'!D25)","v":""},{"$f":"IF('Algemene gegevens'!E25=\"\",\"\",'Algemene gegevens'!E25)","v":""},{"$f":"IF('Algemene gegevens'!F25=\"\",\"\",'Algemene gegevens'!F25)","v":""},{"$f":"IF(E27=\"\",\"\",IF((VLOOKUP(E27,Data!$A$11:$F$31,6,FALSE)=1),IF(E27=\"\",\"\",(IF(VLOOKUP(E27,Data!$A$11:$D$31,2,FALSE)*F27<VLOOKUP(E27,Data!$A$11:$D$31,3,FALSE),ROUND(VLOOKUP(E27,Data!$A$11:$D$31,3,FALSE),0),IF(VLOOKUP(E27,Data!$A$11:$D$31,2,FALSE)*F27>VLOOKUP(E27,Data!$A$11:$D$31,4,FALSE),ROUND(VLOOKUP(E27,Data!$A$11:$D$31,4,FALSE),0),ROUND(VLOOKUP(E27,Data!$A$11:$D$31,2,FALSE)*F27,0))))),\"\"))","v":""},{"$f":"IF(E27=\"\",\"\",IF((VLOOKUP(E27,Data!$A$11:$F$31,6,FALSE)=1),IF((2*(VLOOKUP(E27,Data!$A$11:$D$31,2,FALSE)*F27))<(2*(VLOOKUP(E27,Data!$A$11:$D$31,3,FALSE))),ROUND(2*(VLOOKUP(E27,Data!$A$11:$D$31,3,FALSE)),0),ROUND(2*(VLOOKUP(E27,Data!$A$11:$D$31,2,FALSE))*F27,0)),\"\"))","v":""},null,"P0",{"$f":"IF(F27=\"\",\"\",IF((VLOOKUP(E27,Data!$A$11:$F$31,6,FALSE)=1),ROUND(VLOOKUP($E27,Data!$A$11:$F$31,5,FALSE),0),\"\"))","v":""},{"$f":"IF(F27=\"\",\"\",IF((VLOOKUP(E27,Data!$A$11:$F$31,6,FALSE)=2),ROUND(VLOOKUP($E27,Data!$A$11:$F$31,5,FALSE),0),\"\"))","v":""},null,{"$f":"IF($E27=\"\",\"\",IF((VLOOKUP($E27,Data!$A$11:$F$31,6,FALSE)=2),IF($E27=\"\",\"\",(IF(VLOOKUP($E27,Data!$A$11:$F$31,2,FALSE)*$F27<VLOOKUP($E27,Data!$A$11:$F$31,3,FALSE),VLOOKUP($E27,Data!$A$11:$F$31,3,FALSE),IF(VLOOKUP($E27,Data!$A$11:$F$31,2,FALSE)*$F27>VLOOKUP($E27,Data!$A$11:$F$31,4,FALSE),VLOOKUP($E27,Data!$A$11:$F$31,4,FALSE),ROUND(VLOOKUP($E27,Data!$A$11:$F$31,2,FALSE)*$F27,0))))),\"\"))","v":""},null,null,null,null,{"$f":"IF('Algemene gegevens'!C25=\"\",\"\",'Algemene gegevens'!C25)","v":""},{"$f":"IF('Algemene gegevens'!D25=\"\",\"\",'Algemene gegevens'!D25)","v":""},null,null,null,null,0,null,null,null,null,null,0,1,1,1,null,{"$f":"IF(F27=\"\",\"\",IF((VLOOKUP(E27,Data!$A$11:$F$31,6,FALSE)=1),ROUND(VLOOKUP($E27,Data!$A$11:$F$31,5,FALSE),0),IF((VLOOKUP(E27,Data!$A$11:$F$31,6,FALSE)=2),ROUND(VLOOKUP($E27,Data!$A$11:$F$31,5,FALSE),0),\"\")))","v":""},0,{"$f":"IF($F27=\"\",\"\",IF(VLOOKUP($E27,Data!$A$11:$F$31,6,FALSE)=1,$AE27*LOOKUP(J27,zelfregelbaarheidsklasse,zelfregelbaarheidsfactor),\"\"))","v":""}]
[null,null,{"$f":"IF('Algemene gegevens'!C26=\"\",\"\",'Algemene gegevens'!C26)","v":""},{"$f":"IF('Algemene gegevens'!D26=\"\",\"\",'Algemene gegevens'!D26)","v":""},{"$f":"IF('Algemene gegevens'!E26=\"\",\"\",'Algemene gegevens'!E26)","v":""},{"$f":"IF('Algemene gegevens'!F26=\"\",\"\",'Algemene gegevens'!F26)","v":""},{"$f":"IF(E28=\"\",\"\",IF((VLOOKUP(E28,Data!$A$11:$F$31,6,FALSE)=1),IF(E28=\"\",\"\",(IF(VLOOKUP(E28,Data!$A$11:$D$31,2,FALSE)*F28<VLOOKUP(E28,Data!$A$11:$D$31,3,FALSE),ROUND(VLOOKUP(E28,Data!$A$11:$D$31,3,FALSE),0),IF(VLOOKUP(E28,Data!$A$11:$D$31,2,FALSE)*F28>VLOOKUP(E28,Data!$A$11:$D$31,4,FALSE),ROUND(VLOOKUP(E28,Data!$A$11:$D$31,4,FALSE),0),ROUND(VLOOKUP(E28,Data!$A$11:$D$31,2,FALSE)*F28,0))))),\"\"))","v":""},{"$f":"IF(E28=\"\",\"\",IF((VLOOKUP(E28,Data!$A$11:$F$31,6,FALSE)=1),IF((2*(VLOOKUP(E28,Data!$A$11:$D$31,2,FALSE)*F28))<(2*(VLOOKUP(E28,Data!$A$11:$D$31,3,FALSE))),ROUND(2*(VLOOKUP(E28,Data!$A$11:$D$31,3,FALSE)),0),ROUND(2*(VLOOKUP(E28,Data!$A$11:$D$31,2,FALSE))*F28,0)),\"\"))","v":""},null,"P0",{"$f":"IF(F28=\"\",\"\",IF((VLOOKUP(E28,Data!$A$11:$F$31,6,FALSE)=1),ROUND(VLOOKUP($E28,Data!$A$11:$F$31,5,FALSE),0),\"\"))","v":""},{"$f":"IF(F28=\"\",\"\",IF((VLOOKUP(E28,Data!$A$11:$F$31,6,FALSE)=2),ROUND(VLOOKUP($E28,Data!$A$11:$F$31,5,FALSE),0),\"\"))","v":""},null,{"$f":"IF($E28=\"\",\"\",IF((VLOOKUP($E28,Data!$A$11:$F$31,6,FALSE)=2),IF($E28=\"\",\"\",(IF(VLOOKUP($E28,Data!$A$11:$F$31,2,FALSE)*$F28<VLOOKUP($E28,Data!$A$11:$F$31,3,FALSE),VLOOKUP($E28,Data!$A$11:$F$31,3,FALSE),IF(VLOOKUP($E28,Data!$A$11:$F$31,2,FALSE)*$F28>VLOOKUP($E28,Data!$A$11:$F$31,4,FALSE),VLOOKUP($E28,Data!$A$11:$F$31,4,FALSE),ROUND(VLOOKUP($E28,Data!$A$11:$F$31,2,FALSE)*$F28,0))))),\"\"))","v":""},null,null,null,null,{"$f":"IF('Algemene gegevens'!C26=\"\",\"\",'Algemene gegevens'!C26)","v":""},{"$f":"IF('Algemene gegevens'!D26=\"\",\"\",'Algemene gegevens'!D26)","v":""},null,null,null,null,0,null,null,null,null,null,0,1,1,1,null,{"$f":"IF(F28=\"\",\"\",IF((VLOOKUP(E28,Data!$A$11:$F$31,6,FALSE)=1),ROUND(VLOOKUP($E28,Data!$A$11:$F$31,5,FALSE),0),IF((VLOOKUP(E28,Data!$A$11:$F$31,6,FALSE)=2),ROUND(VLOOKUP($E28,Data!$A$11:$F$31,5,FALSE),0),\"\")))","v":""},0,{"$f":"IF($F28=\"\",\"\",IF(VLOOKUP($E28,Data!$A$11:$F$31,6,FALSE)=1,$AE28*LOOKUP(J28,zelfregelbaarheidsklasse,zelfregelbaarheidsfactor),\"\"))","v":""}]
[null,null,{"$f":"IF('Algemene gegevens'!C27=\"\",\"\",'Algemene gegevens'!C27)","v":""},{"$f":"IF('Algemene gegevens'!D27=\"\",\"\",'Algemene gegevens'!D27)","v":""},{"$f":"IF('Algemene gegevens'!E27=\"\",\"\",'Algemene gegevens'!E27)","v":""},{"$f":"IF('Algemene gegevens'!F27=\"\",\"\",'Algemene gegevens'!F27)","v":""},{"$f":"IF(E29=\"\",\"\",IF((VLOOKUP(E29,Data!$A$11:$F$31,6,FALSE)=1),IF(E29=\"\",\"\",(IF(VLOOKUP(E29,Data!$A$11:$D$31,2,FALSE)*F29<VLOOKUP(E29,Data!$A$11:$D$31,3,FALSE),ROUND(VLOOKUP(E29,Data!$A$11:$D$31,3,FALSE),0),IF(VLOOKUP(E29,Data!$A$11:$D$31,2,FALSE)*F29>VLOOKUP(E29,Data!$A$11:$D$31,4,FALSE),ROUND(VLOOKUP(E29,Data!$A$11:$D$31,4,FALSE),0),ROUND(VLOOKUP(E29,Data!$A$11:$D$31,2,FALSE)*F29,0))))),\"\"))","v":""},{"$f":"IF(E29=\"\",\"\",IF((VLOOKUP(E29,Data!$A$11:$F$31,6,FALSE)=1),IF((2*(VLOOKUP(E29,Data!$A$11:$D$31,2,FALSE)*F29))<(2*(VLOOKUP(E29,Data!$A$11:$D$31,3,FALSE))),ROUND(2*(VLOOKUP(E29,Data!$A$11:$D$31,3,FALSE)),0),ROUND(2*(VLOOKUP(E29,Data!$A$11:$D$31,2,FALSE))*F29,0)),\"\"))","v":""},null,"P0",{"$f":"IF(F29=\"\",\"\",IF((VLOOKUP(E29,Data!$A$11:$F$31,6,FALSE)=1),ROUND(VLOOKUP($E29,Data!$A$11:$F$31,5,FALSE),0),\"\"))","v":""},{"$f":"IF(F29=\"\",\"\",IF((VLOOKUP(E29,Data!$A$11:$F$31,6,FALSE)=2),ROUND(VLOOKUP($E29,Data!$A$11:$F$31,5,FALSE),0),\"\"))","v":""},null,{"$f":"IF($E29=\"\",\"\",IF((VLOOKUP($E29,Data!$A$11:$F$31,6,FALSE)=2),IF($E29=\"\",\"\",(IF(VLOOKUP($E29,Data!$A$11:$F$31,2,FALSE)*$F29<VLOOKUP($E29,Data!$A$11:$F$31,3,FALSE),VLOOKUP($E29,Data!$A$11:$F$31,3,FALSE),IF(VLOOKUP($E29,Data!$A$11:$F$31,2,FALSE)*$F29>VLOOKUP($E29,Data!$A$11:$F$31,4,FALSE),VLOOKUP($E29,Data!$A$11:$F$31,4,FALSE),ROUND(VLOOKUP($E29,Data!$A$11:$F$31,2,FALSE)*$F29,0))))),\"\"))","v":""},null,null,null,null,{"$f":"IF('Algemene gegevens'!C27=\"\",\"\",'Algemene gegevens'!C27)","v":""},{"$f":"IF('Algemene gegevens'!D27=\"\",\"\",'Algemene gegevens'!D27)","v":""},null,null,null,null,0,null,null,null,null,null,0,1,1,1,null,{"$f":"IF(F29=\"\",\"\",IF((VLOOKUP(E29,Data!$A$11:$F$31,6,FALSE)=1),ROUND(VLOOKUP($E29,Data!$A$11:$F$31,5,FALSE),0),IF((VLOOKUP(E29,Data!$A$11:$F$31,6,FALSE)=2),ROUND(VLOOKUP($E29,Data!$A$11:$F$31,5,FALSE),0),\"\")))","v":""},0,{"$f":"IF($F29=\"\",\"\",IF(VLOOKUP($E29,Data!$A$11:$F$31,6,FALSE)=1,$AE29*LOOKUP(J29,zelfregelbaarheidsklasse,zelfregelbaarheidsfactor),\"\"))","v":""}]
[null,null,{"$f":"IF('Algemene gegevens'!C28=\"\",\"\",'Algemene gegevens'!C28)","v":""},{"$f":"IF('Algemene gegevens'!D28=\"\",\"\",'Algemene gegevens'!D28)","v":""},{"$f":"IF('Algemene gegevens'!E28=\"\",\"\",'Algemene gegevens'!E28)","v":""},{"$f":"IF('Algemene gegevens'!F28=\"\",\"\",'Algemene gegevens'!F28)","v":""},{"$f":"IF(E30=\"\",\"\",IF((VLOOKUP(E30,Data!$A$11:$F$31,6,FALSE)=1),IF(E30=\"\",\"\",(IF(VLOOKUP(E30,Data!$A$11:$D$31,2,FALSE)*F30<VLOOKUP(E30,Data!$A$11:$D$31,3,FALSE),ROUND(VLOOKUP(E30,Data!$A$11:$D$31,3,FALSE),0),IF(VLOOKUP(E30,Data!$A$11:$D$31,2,FALSE)*F30>VLOOKUP(E30,Data!$A$11:$D$31,4,FALSE),ROUND(VLOOKUP(E30,Data!$A$11:$D$31,4,FALSE),0),ROUND(VLOOKUP(E30,Data!$A$11:$D$31,2,FALSE)*F30,0))))),\"\"))","v":""},{"$f":"IF(E30=\"\",\"\",IF((VLOOKUP(E30,Data!$A$11:$F$31,6,FALSE)=1),IF((2*(VLOOKUP(E30,Data!$A$11:$D$31,2,FALSE)*F30))<(2*(VLOOKUP(E30,Data!$A$11:$D$31,3,FALSE))),ROUND(2*(VLOOKUP(E30,Data!$A$11:$D$31,3,FALSE)),0),ROUND(2*(VLOOKUP(E30,Data!$A$11:$D$31,2,FALSE))*F30,0)),\"\"))","v":""},null,"P0",{"$f":"IF(F30=\"\",\"\",IF((VLOOKUP(E30,Data!$A$11:$F$31,6,FALSE)=1),ROUND(VLOOKUP($E30,Data!$A$11:$F$31,5,FALSE),0),\"\"))","v":""},{"$f":"IF(F30=\"\",\"\",IF((VLOOKUP(E30,Data!$A$11:$F$31,6,FALSE)=2),ROUND(VLOOKUP($E30,Data!$A$11:$F$31,5,FALSE),0),\"\"))","v":""},null,{"$f":"IF($E30=\"\",\"\",IF((VLOOKUP($E30,Data!$A$11:$F$31,6,FALSE)=2),IF($E30=\"\",\"\",(IF(VLOOKUP($E30,Data!$A$11:$F$31,2,FALSE)*$F30<VLOOKUP($E30,Data!$A$11:$F$31,3,FALSE),VLOOKUP($E30,Data!$A$11:$F$31,3,FALSE),IF(VLOOKUP($E30,Data!$A$11:$F$31,2,FALSE)*$F30>VLOOKUP($E30,Data!$A$11:$F$31,4,FALSE),VLOOKUP($E30,Data!$A$11:$F$31,4,FALSE),ROUND(VLOOKUP($E30,Data!$A$11:$F$31,2,FALSE)*$F30,0))))),\"\"))","v":""},null,null,null,null,{"$f":"IF('Algemene gegevens'!C28=\"\",\"\",'Algemene gegevens'!C28)","v":""},{"$f":"IF('Algemene gegevens'!D28=\"\",\"\",'Algemene gegevens'!D28)","v":""},null,null,null,null,0,null,null,null,null,null,0,1,1,1,null,{"$f":"IF(F30=\"\",\"\",IF((VLOOKUP(E30,Data!$A$11:$F$31,6,FALSE)=1),ROUND(VLOOKUP($E30,Data!$A$11:$F$31,5,FALSE),0),IF((VLOOKUP(E30,Data!$A$11:$F$31,6,FALSE)=2),ROUND(VLOOKUP($E30,Data!$A$11:$F$31,5,FALSE),0),\"\")))","v":""},0,{"$f":"IF($F30=\"\",\"\",IF(VLOOKUP($E30,Data!$A$11:$F$31,6,FALSE)=1,$AE30*LOOKUP(J30,zelfregelbaarheidsklasse,zelfregelbaarheidsfactor),\"\"))","v":""}]
[null,null,{"$f":"IF('Algemene gegevens'!C29=\"\",\"\",'Algemene gegevens'!C29)","v":""},{"$f":"IF('Algemene gegevens'!D29=\"\",\"\",'Algemene gegevens'!D29)","v":""},{"$f":"IF('Algemene gegevens'!E29=\"\",\"\",'Algemene gegevens'!E29)","v":""},{"$f":"IF('Algemene gegevens'!F29=\"\",\"\",'Algemene gegevens'!F29)","v":""},{"$f":"IF(E31=\"\",\"\",IF((VLOOKUP(E31,Data!$A$11:$F$31,6,FALSE)=1),IF(E31=\"\",\"\",(IF(VLOOKUP(E31,Data!$A$11:$D$31,2,FALSE)*F31<VLOOKUP(E31,Data!$A$11:$D$31,3,FALSE),ROUND(VLOOKUP(E31,Data!$A$11:$D$31,3,FALSE),0),IF(VLOOKUP(E31,Data!$A$11:$D$31,2,FALSE)*F31>VLOOKUP(E31,Data!$A$11:$D$31,4,FALSE),ROUND(VLOOKUP(E31,Data!$A$11:$D$31,4,FALSE),0),ROUND(VLOOKUP(E31,Data!$A$11:$D$31,2,FALSE)*F31,0))))),\"\"))","v":""},{"$f":"IF(E31=\"\",\"\",IF((VLOOKUP(E31,Data!$A$11:$F$31,6,FALSE)=1),IF((2*(VLOOKUP(E31,Data!$A$11:$D$31,2,FALSE)*F31))<(2*(VLOOKUP(E31,Data!$A$11:$D$31,3,FALSE))),ROUND(2*(VLOOKUP(E31,Data!$A$11:$D$31,3,FALSE)),0),ROUND(2*(VLOOKUP(E31,Data!$A$11:$D$31,2,FALSE))*F31,0)),\"\"))","v":""},null,"P0",{"$f":"IF(F31=\"\",\"\",IF((VLOOKUP(E31,Data!$A$11:$F$31,6,FALSE)=1),ROUND(VLOOKUP($E31,Data!$A$11:$F$31,5,FALSE),0),\"\"))","v":""},{"$f":"IF(F31=\"\",\"\",IF((VLOOKUP(E31,Data!$A$11:$F$31,6,FALSE)=2),ROUND(VLOOKUP($E31,Data!$A$11:$F$31,5,FALSE),0),\"\"))","v":""},null,{"$f":"IF($E31=\"\",\"\",IF((VLOOKUP($E31,Data!$A$11:$F$31,6,FALSE)=2),IF($E31=\"\",\"\",(IF(VLOOKUP($E31,Data!$A$11:$F$31,2,FALSE)*$F31<VLOOKUP($E31,Data!$A$11:$F$31,3,FALSE),VLOOKUP($E31,Data!$A$11:$F$31,3,FALSE),IF(VLOOKUP($E31,Data!$A$11:$F$31,2,FALSE)*$F31>VLOOKUP($E31,Data!$A$11:$F$31,4,FALSE),VLOOKUP($E31,Data!$A$11:$F$31,4,FALSE),ROUND(VLOOKUP($E31,Data!$A$11:$F$31,2,FALSE)*$F31,0))))),\"\"))","v":""},null,null,null,null,{"$f":"IF('Algemene gegevens'!C29=\"\",\"\",'Algemene gegevens'!C29)","v":""},{"$f":"IF('Algemene gegevens'!D29=\"\",\"\",'Algemene gegevens'!D29)","v":""},null,null,null,null,0,null,null,null,null,null,0,1,1,1,null,{"$f":"IF(F31=\"\",\"\",IF((VLOOKUP(E31,Data!$A$11:$F$31,6,FALSE)=1),ROUND(VLOOKUP($E31,Data!$A$11:$F$31,5,FALSE),0),IF((VLOOKUP(E31,Data!$A$11:$F$31,6,FALSE)=2),ROUND(VLOOKUP($E31,Data!$A$11:$F$31,5,FALSE),0),\"\")))","v":""},0,{"$f":"IF($F31=\"\",\"\",IF(VLOOKUP($E31,Data!$A$11:$F$31,6,FALSE)=1,$AE31*LOOKUP(J31,zelfregelbaarheidsklasse,zelfregelbaarheidsfactor),\"\"))","v":""}]
[null,null,{"$f":"IF('Algemene gegevens'!C30=\"\",\"\",'Algemene gegevens'!C30)","v":""},{"$f":"IF('Algemene gegevens'!D30=\"\",\"\",'Algemene gegevens'!D30)","v":""},{"$f":"IF('Algemene gegevens'!E30=\"\",\"\",'Algemene gegevens'!E30)","v":""},{"$f":"IF('Algemene gegevens'!F30=\"\",\"\",'Algemene gegevens'!F30)","v":""},{"$f":"IF(E32=\"\",\"\",IF((VLOOKUP(E32,Data!$A$11:$F$31,6,FALSE)=1),IF(E32=\"\",\"\",(IF(VLOOKUP(E32,Data!$A$11:$D$31,2,FALSE)*F32<VLOOKUP(E32,Data!$A$11:$D$31,3,FALSE),ROUND(VLOOKUP(E32,Data!$A$11:$D$31,3,FALSE),0),IF(VLOOKUP(E32,Data!$A$11:$D$31,2,FALSE)*F32>VLOOKUP(E32,Data!$A$11:$D$31,4,FALSE),ROUND(VLOOKUP(E32,Data!$A$11:$D$31,4,FALSE),0),ROUND(VLOOKUP(E32,Data!$A$11:$D$31,2,FALSE)*F32,0))))),\"\"))","v":""},{"$f":"IF(E32=\"\",\"\",IF((VLOOKUP(E32,Data!$A$11:$F$31,6,FALSE)=1),IF((2*(VLOOKUP(E32,Data!$A$11:$D$31,2,FALSE)*F32))<(2*(VLOOKUP(E32,Data!$A$11:$D$31,3,FALSE))),ROUND(2*(VLOOKUP(E32,Data!$A$11:$D$31,3,FALSE)),0),ROUND(2*(VLOOKUP(E32,Data!$A$11:$D$31,2,FALSE))*F32,0)),\"\"))","v":""},null,"P0",{"$f":"IF(F32=\"\",\"\",IF((VLOOKUP(E32,Data!$A$11:$F$31,6,FALSE)=1),ROUND(VLOOKUP($E32,Data!$A$11:$F$31,5,FALSE),0),\"\"))","v":""},{"$f":"IF(F32=\"\",\"\",IF((VLOOKUP(E32,Data!$A$11:$F$31,6,FALSE)=2),ROUND(VLOOKUP($E32,Data!$A$11:$F$31,5,FALSE),0),\"\"))","v":""},null,{"$f":"IF($E32=\"\",\"\",IF((VLOOKUP($E32,Data!$A$11:$F$31,6,FALSE)=2),IF($E32=\"\",\"\",(IF(VLOOKUP($E32,Data!$A$11:$F$31,2,FALSE)*$F32<VLOOKUP($E32,Data!$A$11:$F$31,3,FALSE),VLOOKUP($E32,Data!$A$11:$F$31,3,FALSE),IF(VLOOKUP($E32,Data!$A$11:$F$31,2,FALSE)*$F32>VLOOKUP($E32,Data!$A$11:$F$31,4,FALSE),VLOOKUP($E32,Data!$A$11:$F$31,4,FALSE),ROUND(VLOOKUP($E32,Data!$A$11:$F$31,2,FALSE)*$F32,0))))),\"\"))","v":""},null,null,null,null,{"$f":"IF('Algemene gegevens'!C30=\"\",\"\",'Algemene gegevens'!C30)","v":""},{"$f":"IF('Algemene gegevens'!D30=\"\",\"\",'Algemene gegevens'!D30)","v":""},null,null,null,null,0,null,null,null,null,null,0,1,1,1,null,{"$f":"IF(F32=\"\",\"\",IF((VLOOKUP(E32,Data!$A$11:$F$31,6,FALSE)=1),ROUND(VLOOKUP($E32,Data!$A$11:$F$31,5,FALSE),0),IF((VLOOKUP(E32,Data!$A$11:$F$31,6,FALSE)=2),ROUND(VLOOKUP($E32,Data!$A$11:$F$31,5,FALSE),0),\"\")))","v":""},0,{"$f":"IF($F32=\"\",\"\",IF(VLOOKUP($E32,Data!$A$11:$F$31,6,FALSE)=1,$AE32*LOOKUP(J32,zelfregelbaarheidsklasse,zelfregelbaarheidsfactor),\"\"))","v":""}]
[null,null,{"$f":"IF('Algemene gegevens'!C31=\"\",\"\",'Algemene gegevens'!C31)","v":""},{"$f":"IF('Algemene gegevens'!D31=\"\",\"\",'Algemene gegevens'!D31)","v":""},{"$f":"IF('Algemene gegevens'!E31=\"\",\"\",'Algemene gegevens'!E31)","v":""},{"$f":"IF('Algemene gegevens'!F31=\"\",\"\",'Algemene gegevens'!F31)","v":""},{"$f":"IF(E33=\"\",\"\",IF((VLOOKUP(E33,Data!$A$11:$F$31,6,FALSE)=1),IF(E33=\"\",\"\",(IF(VLOOKUP(E33,Data!$A$11:$D$31,2,FALSE)*F33<VLOOKUP(E33,Data!$A$11:$D$31,3,FALSE),ROUND(VLOOKUP(E33,Data!$A$11:$D$31,3,FALSE),0),IF(VLOOKUP(E33,Data!$A$11:$D$31,2,FALSE)*F33>VLOOKUP(E33,Data!$A$11:$D$31,4,FALSE),ROUND(VLOOKUP(E33,Data!$A$11:$D$31,4,FALSE),0),ROUND(VLOOKUP(E33,Data!$A$11:$D$31,2,FALSE)*F33,0))))),\"\"))","v":""},{"$f":"IF(E33=\"\",\"\",IF((VLOOKUP(E33,Data!$A$11:$F$31,6,FALSE)=1),IF((2*(VLOOKUP(E33,Data!$A$11:$D$31,2,FALSE)*F33))<(2*(VLOOKUP(E33,Data!$A$11:$D$31,3,FALSE))),ROUND(2*(VLOOKUP(E33,Data!$A$11:$D$31,3,FALSE)),0),ROUND(2*(VLOOKUP(E33,Data!$A$11:$D$31,2,FALSE))*F33,0)),\"\"))","v":""},null,"P0",{"$f":"IF(F33=\"\",\"\",IF((VLOOKUP(E33,Data!$A$11:$F$31,6,FALSE)=1),ROUND(VLOOKUP($E33,Data!$A$11:$F$31,5,FALSE),0),\"\"))","v":""},{"$f":"IF(F33=\"\",\"\",IF((VLOOKUP(E33,Data!$A$11:$F$31,6,FALSE)=2),ROUND(VLOOKUP($E33,Data!$A$11:$F$31,5,FALSE),0),\"\"))","v":""},null,{"$f":"IF($E33=\"\",\"\",IF((VLOOKUP($E33,Data!$A$11:$F$31,6,FALSE)=2),IF($E33=\"\",\"\",(IF(VLOOKUP($E33,Data!$A$11:$F$31,2,FALSE)*$F33<VLOOKUP($E33,Data!$A$11:$F$31,3,FALSE),VLOOKUP($E33,Data!$A$11:$F$31,3,FALSE),IF(VLOOKUP($E33,Data!$A$11:$F$31,2,FALSE)*$F33>VLOOKUP($E33,Data!$A$11:$F$31,4,FALSE),VLOOKUP($E33,Data!$A$11:$F$31,4,FALSE),ROUND(VLOOKUP($E33,Data!$A$11:$F$31,2,FALSE)*$F33,0))))),\"\"))","v":""},null,null,null,null,{"$f":"IF('Algemene gegevens'!C31=\"\",\"\",'Algemene gegevens'!C31)","v":""},{"$f":"IF('Algemene gegevens'!D31=\"\",\"\",'Algemene gegevens'!D31)","v":""},null,null,null,null,0,null,null,null,null,null,0,1,1,1,null,{"$f":"IF(F33=\"\",\"\",IF((VLOOKUP(E33,Data!$A$11:$F$31,6,FALSE)=1),ROUND(VLOOKUP($E33,Data!$A$11:$F$31,5,FALSE),0),IF((VLOOKUP(E33,Data!$A$11:$F$31,6,FALSE)=2),ROUND(VLOOKUP($E33,Data!$A$11:$F$31,5,FALSE),0),\"\")))","v":""},0,{"$f":"IF($F33=\"\",\"\",IF(VLOOKUP($E33,Data!$A$11:$F$31,6,FALSE)=1,$AE33*LOOKUP(J33,zelfregelbaarheidsklasse,zelfregelbaarheidsfactor),\"\"))","v":""}]
[null,null,{"$f":"IF('Algemene gegevens'!C32=\"\",\"\",'Algemene gegevens'!C32)","v":""},{"$f":"IF('Algemene gegevens'!D32=\"\",\"\",'Algemene gegevens'!D32)","v":""},{"$f":"IF('Algemene gegevens'!E32=\"\",\"\",'Algemene gegevens'!E32)","v":""},{"$f":"IF('Algemene gegevens'!F32=\"\",\"\",'Algemene gegevens'!F32)","v":""},{"$f":"IF(E34=\"\",\"\",IF((VLOOKUP(E34,Data!$A$11:$F$31,6,FALSE)=1),IF(E34=\"\",\"\",(IF(VLOOKUP(E34,Data!$A$11:$D$31,2,FALSE)*F34<VLOOKUP(E34,Data!$A$11:$D$31,3,FALSE),ROUND(VLOOKUP(E34,Data!$A$11:$D$31,3,FALSE),0),IF(VLOOKUP(E34,Data!$A$11:$D$31,2,FALSE)*F34>VLOOKUP(E34,Data!$A$11:$D$31,4,FALSE),ROUND(VLOOKUP(E34,Data!$A$11:$D$31,4,FALSE),0),ROUND(VLOOKUP(E34,Data!$A$11:$D$31,2,FALSE)*F34,0))))),\"\"))","v":""},{"$f":"IF(E34=\"\",\"\",IF((VLOOKUP(E34,Data!$A$11:$F$31,6,FALSE)=1),IF((2*(VLOOKUP(E34,Data!$A$11:$D$31,2,FALSE)*F34))<(2*(VLOOKUP(E34,Data!$A$11:$D$31,3,FALSE))),ROUND(2*(VLOOKUP(E34,Data!$A$11:$D$31,3,FALSE)),0),ROUND(2*(VLOOKUP(E34,Data!$A$11:$D$31,2,FALSE))*F34,0)),\"\"))","v":""},null,"P0",{"$f":"IF(F34=\"\",\"\",IF((VLOOKUP(E34,Data!$A$11:$F$31,6,FALSE)=1),ROUND(VLOOKUP($E34,Data!$A$11:$F$31,5,FALSE),0),\"\"))","v":""},{"$f":"IF(F34=\"\",\"\",IF((VLOOKUP(E34,Data!$A$11:$F$31,6,FALSE)=2),ROUND(VLOOKUP($E34,Data!$A$11:$F$31,5,FALSE),0),\"\"))","v":""},null,{"$f":"IF($E34=\"\",\"\",IF((VLOOKUP($E34,Data!$A$11:$F$31,6,FALSE)=2),IF($E34=\"\",\"\",(IF(VLOOKUP($E34,Data!$A$11:$F$31,2,FALSE)*$F34<VLOOKUP($E34,Data!$A$11:$F$31,3,FALSE),VLOOKUP($E34,Data!$A$11:$F$31,3,FALSE),IF(VLOOKUP($E34,Data!$A$11:$F$31,2,FALSE)*$F34>VLOOKUP($E34,Data!$A$11:$F$31,4,FALSE),VLOOKUP($E34,Data!$A$11:$F$31,4,FALSE),ROUND(VLOOKUP($E34,Data!$A$11:$F$31,2,FALSE)*$F34,0))))),\"\"))","v":""},null,null,null,null,{"$f":"IF('Algemene gegevens'!C32=\"\",\"\",'Algemene gegevens'!C32)","v":""},{"$f":"IF('Algemene gegevens'!D32=\"\",\"\",'Algemene gegevens'!D32)","v":""},null,null,null,null,0,null,null,null,null,null,0,1,1,1,null,{"$f":"IF(F34=\"\",\"\",IF((VLOOKUP(E34,Data!$A$11:$F$31,6,FALSE)=1),ROUND(VLOOKUP($E34,Data!$A$11:$F$31,5,FALSE),0),IF((VLOOKUP(E34,Data!$A$11:$F$31,6,FALSE)=2),ROUND(VLOOKUP($E34,Data!$A$11:$F$31,5,FALSE),0),\"\")))","v":""},0,{"$f":"IF($F34=\"\",\"\",IF(VLOOKUP($E34,Data!$A$11:$F$31,6,FALSE)=1,$AE34*LOOKUP(J34,zelfregelbaarheidsklasse,zelfregelbaarheidsfactor),\"\"))","v":""}]
[null,null,null,null,null,"totalen",{"$f":"SUM(G14:G34)","v":0},{"$f":"SUM(H14:H34)","v":0},{"$f":"SUMPRODUCT(I14:I34,AE14:AE34)","v":0},null,{"$f":"SUM(K14:K34)","v":0},null,null,{"$f":"SUM(N14:N34)","v":0},{"$f":"SUMPRODUCT(O14:O34,AE14:AE34)","v":0},null,null,null,null,null,null,null,null,null,"geen controle op maximumdebiet!",null,null,null,null,null,null,null,null,null,null,null,null,{"$f":"MAX(AL14:AL34)","v":0}]
[]
[]
[]
[]
[]
[null,null,"Lekdebieten kanalen"]
[null,null,null,null,null,null,null,null,null,null,null,null,null,null,"(m³/h)"]
[null,null,null,null,null,"Lekdebiet afvoerkanalen",null,null,null,null,null,null,null,"lekdebietsmeting?","ja"]
[]
[null,null,null,null,null,null,null,null,null,null,null,null,null,"ontstenteniswaarde",{"$f":"IF($AE$4=\"A\",0.025*N35,IF($AE$4=\"B\",0.025*K35,IF($AE$4=\"C\",0.18*K35,0.18*K35)))","v":0}]
[null,null,null,null,null,null,null,null,null,null,null,null,null,"maximaal gewenste waarde"]
[null,null,null,null,null,null,null,null,null,null,null,null,null,"gemeten:"]
[]
[null,null,null,null,null,null,null,null,null,null,null,null,null,null,null,null,null,null,null,null,null,null,null,null,null,null,null,null,null,null,"A"]
[null,null,"VERMENIGVULDIGINGSFACTOR m:",null,null,null,null,null,null,null,null,null,null,null,{"$f":"+IF(AE4=\"A\",AE50,\"\")","v":1.5},null,null,null,null,null,null,null,null,null,null,null,null,null,null,null,{"$f":"1+0.5*(IF(AL35=0,0.2,AL35)+0.2+IF(O43=\"nee\",0.025,IF(O47=\"\",0.025,MIN(O47/N35,0.025))))/0.425","v":1.5}]
[null,null,"De vermenigvuldigingsfactor werd berekend volgens bijlage B.1 van bijlage I bij het EPB-besluit. "]

{"sheet":"B","index":3,"n_rows":71,"n_cols":37,"rows_kept":71,"cut":false,"hidden":false,"merged":[[70,19,70,20],[66,19,66,20],[67,19,67,20],[68,19,68,20],[69,19,69,20],[61,19,61,20],[64,19,64,20],[65,19,65,20],[3,4,3,8],[60,4,60,5],[10,6,10,8],[10,12,10,13],[9,6,9,13],[10,9,10,11]]}
[]
[null,null,"Berekeningsblad VENTILATIE"]
[null,null,null,null,null,null,null,null,null,null,null,null,null,null,null,null,null,null,null,null,null,null,null,null,null,null,null,null,null,"hulptabel"]
[null,null,"Ventilatiesysteem",null,"B: mechanische toevoer, vrije afvoer",null,null,null,null,null,null,null,null,null,null,null,null,null,null,null,null,null,null,null,null,null,null,null,null,{"$f":"LOOKUP(E4,ventilatiesysteem,Data!B5:B8)","v":"B"},{"$f":"LOOKUP(E4,ventilatiesysteem,Data!C5:C8)","v":2}]
[]
[null,null,"SPECIFICATIEBLAD",null,null,null,null,null,null,null,null,null,null,null,null,null,null,null,null,"PRODUCTKEUZE",null,null,null,null,null,null,null,null,null,{"$f":"+N56","v":1.5}]
[]
[]
[null,null,null,null,null,null,null,"debietsmeting ?","ja",null,null,null,null,null,null,null,null,null,null,null,null,null,null,null,null,null,null,null,{"$f":"IF(OR(AE4=1,AE4=3,I9=\"nee\"),\"zwart\",\"niet zwart\")","v":"niet zwart"}]
[null,null,null,null,null,null,"Debiet"]
[null,null,null,null,null,null,"Toevoer",null,null,"Doorstroom",null,null,"Afvoer"]
[null,null,"Naam","Code","Soort ruimte","Opp","opgelegd minimum","ontwerp","gemeten","minimum (afvoer)","minimum (toevoer)","ontwerp","opgelegd minimum","ontwerp",null,null,null,null,null,"Naam","Code","Doorstroom","Afvoer",null,null,null,"actief","actief","verplicht","verplicht","doorvoer","toevoer","doorvoer","afvoer","actief","meting"]
[null,null,null,null,null,"(m²)","(m³/h)","(m³/h)","(m³/h)",null,null,null,"(m³/h)","(m³/h)",null,null,null,null,null,null,null,null,null,null,null,null,null,"toevoer","toevoer","afvoer","minimum","controle","controle","controle","toevoer meting","toevoer","0=ts 100 en 120 %,1=>120%,2=<100%"]
[null,null,{"$f":"IF('Algemene gegevens'!C12=\"\",\"\",'Algemene gegevens'!C12)","v":""},{"$f":"IF('Algemene gegevens'!D12=\"\",\"\",'Algemene gegevens'!D12)","v":""},{"$f":"IF('Algemene gegevens'!E12=\"\",\"\",'Algemene gegevens'!E12)","v":""},{"$f":"IF('Algemene gegevens'!F12=\"\",\"\",'Algemene gegevens'!F12)","v":""},{"$f":"IF(E14=\"\",\"\",IF((VLOOKUP(E14,Data!$A$11:$F$31,6,FALSE)=1),IF(E14=\"\",\"\",(IF(VLOOKUP(E14,Data!$A$11:$D$31,2,FALSE)*F14<VLOOKUP(E14,Data!$A$11:$D$31,3,FALSE),ROUND(VLOOKUP(E14,Data!$A$11:$D$31,3,FALSE),0),IF(VLOOKUP(E14,Data!$A$11:$D$31,2,FALSE)*F14>VLOOKUP(E14,Data!$A$11:$D$31,4,FALSE),ROUND(VLOOKUP(E14,Data!$A$11:$D$31,4,FALSE),0),ROUND(VLOOKUP(E14,Data!$A$11:$D$31,2,FALSE)*F14,0))))),\"\"))","v":""},null,null,{"$f":"IF(E14=\"\",\"\",IF((VLOOKUP(E14,Data!$A$11:$F$31,6,FALSE)=1),ROUND(VLOOKUP($E14,Data!$A$11:$F$31,5,FALSE),0),\"\"))","v":""},{"$f":"IF(E14=\"\",\"\",IF((VLOOKUP(E14,Data!$A$11:$F$31,6,FALSE)=2),ROUND(VLOOKUP($E14,Data!$A$11:$F$31,5,FALSE),0),\"\"))","v":""},null,{"$f":"IF($E14=\"\",\"\",IF((VLOOKUP($E14,Data!$A$11:$F$31,6,FALSE)=2),IF($E14=\"\",\"\",(IF(VLOOKUP($E14,Data!$A$11:$F$31,2,FALSE)*$F14<VLOOKUP($E14,Data!$A$11:$F$31,3,FALSE),VLOOKUP($E14,Data!$A$11:$F$31,3,FALSE),IF(VLOOKUP($E14,Data!$A$11:$F$31,2,FALSE)*$F14>VLOOKUP($E14,Data!$A$11:$F$31,4,FALSE),VLOOKUP($E14,Data!$A$11:$F$31,4,FALSE),ROUND(VLOOKUP($E14,Data!$A$11:$F$31,2,FALSE)*$F14,0))))),\"\"))","v":""},null,null,null,null,null,null,{"$f":"IF('Algemene gegevens'!$C12=\"\",\"\",'Algemene gegevens'!$C12)","v":""},{"$f":"IF('Algemene gegevens'!$D12=\"\",\"\",'Algemene gegevens'!$D12)","v":""},null,null,null,null,null,{"$f":"IF(F14=\"\",0,1)","v":0},{"$f":"IF(F14=\"\",0,IF(G14=\"\",0,1))","v":0},{"$f":"IF($F14=\"\",0,IF(VLOOKUP($E14,Data!$A$11:$F$31,6,FALSE)=1,1,0))","v":0},{"$f":"IF($F14=\"\",0,IF(VLOOKUP($E14,Data!$A$11:$F$31,6,FALSE)=2,1,0))","v":0},{"$f":"IF(E14=\"\",\"\",IF((VLOOKUP(E14,Data!$A$11:$F$31,6,FALSE)=1),ROUND(VLOOKUP($E14,Data!$A$11:$F$31,5,FALSE),0),IF((VLOOKUP(E14,Data!$A$11:$F$31,6,FALSE)=2),ROUND(VLOOKUP($E14,Data!$A$11:$F$31,5,FALSE),0),\"\")))","v":""},{"$f":"(IF(G14=\"\",1,IF(H14>=G14,1,0)))","v":1},{"$f":"(IF(AE14=\"\",1,IF(L14>=AE14,1,0)))","v":1},{"$f":"(IF(M14=\"\",1,IF(N14>=M14,1,0)))","v":1},{"$f":"IF(I$9=\"nee\",0,IF(F14=\"\",0,IF(OR(H14<>\"\",G14<>\"\"),1,0)))","v":0},{"$f":"IF(G14=\"\",-1,IF($I$9=\"ja\",AC14*IF(AND(I14>=G14,I14<=G14*1.2),0,IF(I14>=G14*1.2,1,2)),0))","v":-1}]
[null,null,{"$f":"IF('Algemene gegevens'!C13=\"\",\"\",'Algemene gegevens'!C13)","v":""},{"$f":"IF('Algemene gegevens'!D13=\"\",\"\",'Algemene gegevens'!D13)","v":""},{"$f":"IF('Algemene gegevens'!E13=\"\",\"\",'Algemene gegevens'!E13)","v":""},{"$f":"IF('Algemene gegevens'!F13=\"\",\"\",'Algemene gegevens'!F13)","v":""},{"$f":"IF(E15=\"\",\"\",IF((VLOOKUP(E15,Data!$A$11:$F$31,6,FALSE)=1),IF(E15=\"\",\"\",(IF(VLOOKUP(E15,Data!$A$11:$D$31,2,FALSE)*F15<VLOOKUP(E15,Data!$A$11:$D$31,3,FALSE),ROUND(VLOOKUP(E15,Data!$A$11:$D$31,3,FALSE),0),IF(VLOOKUP(E15,Data!$A$11:$D$31,2,FALSE)*F15>VLOOKUP(E15,Data!$A$11:$D$31,4,FALSE),ROUND(VLOOKUP(E15,Data!$A$11:$D$31,4,FALSE),0),ROUND(VLOOKUP(E15,Data!$A$11:$D$31,2,FALSE)*F15,0))))),\"\"))","v":""},null,130,{"$f":"IF(E15=\"\",\"\",IF((VLOOKUP(E15,Data!$A$11:$F$31,6,FALSE)=1),ROUND(VLOOKUP($E15,Data!$A$11:$F$31,5,FALSE),0),\"\"))","v":""},{"$f":"IF(E15=\"\",\"\",IF((VLOOKUP(E15,Data!$A$11:$F$31,6,FALSE)=2),ROUND(VLOOKUP($E15,Data!$A$11:$F$31,5,FALSE),0),\"\"))","v":""},null,{"$f":"IF($E15=\"\",\"\",IF((VLOOKUP($E15,Data!$A$11:$F$31,6,FALSE)=2),IF($E15=\"\",\"\",(IF(VLOOKUP($E15,Data!$A$11:$F$31,2,FALSE)*$F15<VLOOKUP($E15,Data!$A$11:$F$31,3,FALSE),VLOOKUP($E15,Data!$A$11:$F$31,3,FALSE),IF(VLOOKUP($E15,Data!$A$11:$F$31,2,FALSE)*$F15>VLOOKUP($E15,Data!$A$11:$F$31,4,FALSE),VLOOKUP($E15,Data!$A$11:$F$31,4,FALSE),ROUND(VLOOKUP($E15,Data!$A$11:$F$31,2,FALSE)*$F15,0))))),\"\"))","v":""},null,null,null,null,null,null,{"$f":"IF('Algemene gegevens'!$C13=\"\",\"\",'Algemene gegevens'!$C13)","v":""},{"$f":"IF('Algemene gegevens'!$D13=\"\",\"\",'Algemene gegevens'!$D13)","v":""},null,null,null,null,null,0,{"$f":"IF(F15=\"\",0,IF(G15=\"\",0,1))","v":0},{"$f":"IF($F15=\"\",0,IF(VLOOKUP($E15,Data!$A$11:$F$31,6,FALSE)=1,1,0))","v":0},{"$f":"IF($F15=\"\",0,IF(VLOOKUP($E15,Data!$A$11:$F$31,6,FALSE)=2,1,0))","v":0},{"$f":"IF(E15=\"\",\"\",IF((VLOOKUP(E15,Data!$A$11:$F$31,6,FALSE)=1),ROUND(VLOOKUP($E15,Data!$A$11:$F$31,5,FALSE),0),IF((VLOOKUP(E15,Data!$A$11:$F$31,6,FALSE)=2),ROUND(VLOOKUP($E15,Data!$A$11:$F$31,5,FALSE),0),\"\")))","v":""},{"$f":"(IF(G15=\"\",1,IF(H15>=G15,1,0)))","v":1},{"$f":"(IF(AE15=\"\",1,IF(L15>=AE15,1,0)))","v":1},{"$f":"(IF(M15=\"\",1,IF(N15>=M15,1,0)))","v":1},{"$f":"IF(I$9=\"nee\",0,IF(F15=\"\",0,IF(OR(H15<>\"\",G15<>\"\"),1,0)))","v":0},{"$f":"IF(G15=\"\",-1,IF($I$9=\"ja\",AC15*IF(AND(I15>=G15,I15<=G15*1.2),0,IF(I15>=G15*1.2,1,2)),0))","v":-1}]
[null,null,{"$f":"IF('Algemene gegevens'!C14=\"\",\"\",'Algemene gegevens'!C14)","v":""},{"$f":"IF('Algemene gegevens'!D14=\"\",\"\",'Algemene gegevens'!D14)","v":""},{"$f":"IF('Algemene gegevens'!E14=\"\",\"\",'Algemene gegevens'!E14)","v":""},{"$f":"IF('Algemene gegevens'!F14=\"\",\"\",'Algemene gegevens'!F14)","v":""},{"$f":"IF(E16=\"\",\"\",IF((VLOOKUP(E16,Data!$A$11:$F$31,6,FALSE)=1),IF(E16=\"\",\"\",(IF(VLOOKUP(E16,Data!$A$11:$D$31,2,FALSE)*F16<VLOOKUP(E16,Data!$A$11:$D$31,3,FALSE),ROUND(VLOOKUP(E16,Data!$A$11:$D$31,3,FALSE),0),IF(VLOOKUP(E16,Data!$A$11:$D$31,2,FALSE)*F16>VLOOKUP(E16,Data!$A$11:$D$31,4,FALSE),ROUND(VLOOKUP(E16,Data!$A$11:$D$31,4,FALSE),0),ROUND(VLOOKUP(E16,Data!$A$11:$D$31,2,FALSE)*F16,0))))),\"\"))","v":""},null,45,{"$f":"IF(E16=\"\",\"\",IF((VLOOKUP(E16,Data!$A$11:$F$31,6,FALSE)=1),ROUND(VLOOKUP($E16,Data!$A$11:$F$31,5,FALSE),0),\"\"))","v":""},{"$f":"IF(E16=\"\",\"\",IF((VLOOKUP(E16,Data!$A$11:$F$31,6,FALSE)=2),ROUND(VLOOKUP($E16,Data!$A$11:$F$31,5,FALSE),0),\"\"))","v":""},null,{"$f":"IF($E16=\"\",\"\",IF((VLOOKUP($E16,Data!$A$11:$F$31,6,FALSE)=2),IF($E16=\"\",\"\",(IF(VLOOKUP($E16,Data!$A$11:$F$31,2,FALSE)*$F16<VLOOKUP($E16,Data!$A$11:$F$31,3,FALSE),VLOOKUP($E16,Data!$A$11:$F$31,3,FALSE),IF(VLOOKUP($E16,Data!$A$11:$F$31,2,FALSE)*$F16>VLOOKUP($E16,Data!$A$11:$F$31,4,FALSE),VLOOKUP($E16,Data!$A$11:$F$31,4,FALSE),ROUND(VLOOKUP($E16,Data!$A$11:$F$31,2,FALSE)*$F16,0))))),\"\"))","v":""},null,null,null,null,null,null,{"$f":"IF('Algemene gegevens'!$C14=\"\",\"\",'Algemene gegevens'!$C14)","v":""},{"$f":"IF('Algemene gegevens'!$D14=\"\",\"\",'Algemene gegevens'!$D14)","v":""},null,null,null,null,null,0,0,{"$f":"IF($F16=\"\",0,IF(VLOOKUP($E16,Data!$A$11:$F$31,6,FALSE)=1,1,0))","v":0},{"$f":"IF($F16=\"\",0,IF(VLOOKUP($E16,Data!$A$11:$F$31,6,FALSE)=2,1,0))","v":0},{"$f":"IF(E16=\"\",\"\",IF((VLOOKUP(E16,Data!$A$11:$F$31,6,FALSE)=1),ROUND(VLOOKUP($E16,Data!$A$11:$F$31,5,FALSE),0),IF((VLOOKUP(E16,Data!$A$11:$F$31,6,FALSE)=2),ROUND(VLOOKUP($E16,Data!$A$11:$F$31,5,FALSE),0),\"\")))","v":""},1,1,1,0,-1]
[null,null,{"$f":"IF('Algemene gegevens'!C15=\"\",\"\",'Algemene gegevens'!C15)","v":""},{"$f":"IF('Algemene gegevens'!D15=\"\",\"\",'Algemene gegevens'!D15)","v":""},{"$f":"IF('Algemene gegevens'!E15=\"\",\"\",'Algemene gegevens'!E15)","v":""},{"$f":"IF('Algemene gegevens'!F15=\"\",\"\",'Algemene gegevens'!F15)","v":""},{"$f":"IF(E17=\"\",\"\",IF((VLOOKUP(E17,Data!$A$11:$F$31,6,FALSE)=1),IF(E17=\"\",\"\",(IF(VLOOKUP(E17,Data!$A$11:$D$31,2,FALSE)*F17<VLOOKUP(E17,Data!$A$11:$D$31,3,FALSE),ROUND(VLOOKUP(E17,Data!$A$11:$D$31,3,FALSE),0),IF(VLOOKUP(E17,Data!$A$11:$D$31,2,FALSE)*F17>VLOOKUP(E17,Data!$A$11:$D$31,4,FALSE),ROUND(VLOOKUP(E17,Data!$A$11:$D$31,4,FALSE),0),ROUND(VLOOKUP(E17,Data!$A$11:$D$31,2,FALSE)*F17,0))))),\"\"))","v":""},null,null,{"$f":"IF(E17=\"\",\"\",IF((VLOOKUP(E17,Data!$A$11:$F$31,6,FALSE)=1),ROUND(VLOOKUP($E17,Data!$A$11:$F$31,5,FALSE),0),\"\"))","v":""},{"$f":"IF(E17=\"\",\"\",IF((VLOOKUP(E17,Data!$A$11:$F$31,6,FALSE)=2),ROUND(VLOOKUP($E17,Data!$A$11:$F$31,5,FALSE),0),\"\"))","v":""},null,{"$f":"IF($E17=\"\",\"\",IF((VLOOKUP($E17,Data!$A$11:$F$31,6,FALSE)=2),IF($E17=\"\",\"\",(IF(VLOOKUP($E17,Data!$A$11:$F$31,2,FALSE)*$F17<VLOOKUP($E17,Data!$A$11:$F$31,3,FALSE),VLOOKUP($E17,Data!$A$11:$F$31,3,FALSE),IF(VLOOKUP($E17,Data!$A$11:$F$31,2,FALSE)*$F17>VLOOKUP($E17,Data!$A$11:$F$31,4,FALSE),VLOOKUP($E17,Data!$A$11:$F$31,4,FALSE),ROUND(VLOOKUP($E17,Data!$A$11:$F$31,2,FALSE)*$F17,0))))),\"\"))","v":""},null,null,null,null,null,null,{"$f":"IF('Algemene gegevens'!$C15=\"\",\"\",'Algemene gegevens'!$C15)","v":""},{"$f":"IF('Algemene gegevens'!$D15=\"\",\"\",'Algemene gegevens'!$D15)","v":""},null,null,null,null,null,0,0,{"$f":"IF($F17=\"\",0,IF(VLOOKUP($E17,Data!$A$11:$F$31,6,FALSE)=1,1,0))","v":0},{"$f":"IF($F17=\"\",0,IF(VLOOKUP($E17,Data!$A$11:$F$31,6,FALSE)=2,1,0))","v":0},{"$f":"IF(E17=\"\",\"\",IF((VLOOKUP(E17,Data!$A$11:$F$31,6,FALSE)=1),ROUND(VLOOKUP($E17,Data!$A$11:$F$31,5,FALSE),0),IF((VLOOKUP(E17,Data!$A$11:$F$31,6,FALSE)=2),ROUND(VLOOKUP($E17,Data!$A$11:$F$31,5,FALSE),0),\"\")))","v":""},1,1,1,0,-1]
[null,null,{"$f":"IF('Algemene gegevens'!C16=\"\",\"\",'Algemene gegevens'!C16)","v":""},{"$f":"IF('Algemene gegevens'!D16=\"\",\"\",'Algemene gegevens'!D16)","v":""},{"$f":"IF('Algemene gegevens'!E16=\"\",\"\",'Algemene gegevens'!E16)","v":""},{"$f":"IF('Algemene gegevens'!F16=\"\",\"\",'Algemene gegevens'!F16)","v":""},{"$f":"IF(E18=\"\",\"\",IF((VLOOKUP(E18,Data!$A$11:$F$31,6,FALSE)=1),IF(E18=\"\",\"\",(IF(VLOOKUP(E18,Data!$A$11:$D$31,2,FALSE)*F18<VLOOKUP(E18,Data!$A$11:$D$31,3,FALSE),ROUND(VLOOKUP(E18,Data!$A$11:$D$31,3,FALSE),0),IF(VLOOKUP(E18,Data!$A$11:$D$31,2,FALSE)*F18>VLOOKUP(E18,Data!$A$11:$D$31,4,FALSE),ROUND(VLOOKUP(E18,Data!$A$11:$D$31,4,FALSE),0),ROUND(VLOOKUP(E18,Data!$A$11:$D$31,2,FALSE)*F18,0))))),\"\"))","v":""},null,null,{"$f":"IF(E18=\"\",\"\",IF((VLOOKUP(E18,Data!$A$11:$F$31,6,FALSE)=1),ROUND(VLOOKUP($E18,Data!$A$11:$F$31,5,FALSE),0),\"\"))","v":""},{"$f":"IF(E18=\"\",\"\",IF((VLOOKUP(E18,Data!$A$11:$F$31,6,FALSE)=2),ROUND(VLOOKUP($E18,Data!$A$11:$F$31,5,FALSE),0),\"\"))","v":""},null,{"$f":"IF($E18=\"\",\"\",IF((VLOOKUP($E18,Data!$A$11:$F$31,6,FALSE)=2),IF($E18=\"\",\"\",(IF(VLOOKUP($E18,Data!$A$11:$F$31,2,FALSE)*$F18<VLOOKUP($E18,Data!$A$11:$F$31,3,FALSE),VLOOKUP($E18,Data!$A$11:$F$31,3,FALSE),IF(VLOOKUP($E18,Data!$A$11:$F$31,2,FALSE)*$F18>VLOOKUP($E18,Data!$A$11:$F$31,4,FALSE),VLOOKUP($E18,Data!$A$11:$F$31,4,FALSE),ROUND(VLOOKUP($E18,Data!$A$11:$F$31,2,FALSE)*$F18,0))))),\"\"))","v":""},null,null,null,null,null,null,{"$f":"IF('Algemene gegevens'!$C16=\"\",\"\",'Algemene gegevens'!$C16)","v":""},{"$f":"IF('Algemene gegevens'!$D16=\"\",\"\",'Algemene gegevens'!$D16)","v":""},null,null,null,null,null,0,0,{"$f":"IF($F18=\"\",0,IF(VLOOKUP($E18,Data!$A$11:$F$31,6,FALSE)=1,1,0))","v":0},{"$f":"IF($F18=\"\",0,IF(VLOOKUP($E18,Data!$A$11:$F$31,6,FALSE)=2,1,0))","v":0},{"$f":"IF(E18=\"\",\"\",IF((VLOOKUP(E18,Data!$A$11:$F$31,6,FALSE)=1),ROUND(VLOOKUP($E18,Data!$A$11:$F$31,5,FALSE),0),IF((VLOOKUP(E18,Data!$A$11:$F$31,6,FALSE)=2),ROUND(VLOOKUP($E18,Data!$A$11:$F$31,5,FALSE),0),\"\")))","v":""},1,1,1,0,-1]
[null,null,{"$f":"IF('Algemene gegevens'!C17=\"\",\"\",'Algemene gegevens'!C17)","v":""},{"$f":"IF('Algemene gegevens'!D17=\"\",\"\",'Algemene gegevens'!D17)","v":""},{"$f":"IF('Algemene gegevens'!E17=\"\",\"\",'Algemene gegevens'!E17)","v":""},{"$f":"IF('Algemene gegevens'!F17=\"\",\"\",'Algemene gegevens'!F17)","v":""},{"$f":"IF(E19=\"\",\"\",IF((VLOOKUP(E19,Data!$A$11:$F$31,6,FALSE)=1),IF(E19=\"\",\"\",(IF(VLOOKUP(E19,Data!$A$11:$D$31,2,FALSE)*F19<VLOOKUP(E19,Data!$A$11:$D$31,3,FALSE),ROUND(VLOOKUP(E19,Data!$A$11:$D$31,3,FALSE),0),IF(VLOOKUP(E19,Data!$A$11:$D$31,2,FALSE)*F19>VLOOKUP(E19,Data!$A$11:$D$31,4,FALSE),ROUND(VLOOKUP(E19,Data!$A$11:$D$31,4,FALSE),0),ROUND(VLOOKUP(E19,Data!$A$11:$D$31,2,FALSE)*F19,0))))),\"\"))","v":""},null,null,{"$f":"IF(E19=\"\",\"\",IF((VLOOKUP(E19,Data!$A$11:$F$31,6,FALSE)=1),ROUND(VLOOKUP($E19,Data!$A$11:$F$31,5,FALSE),0),\"\"))","v":""},{"$f":"IF(E19=\"\",\"\",IF((VLOOKUP(E19,Data!$A$11:$F$31,6,FALSE)=2),ROUND(VLOOKUP($E19,Data!$A$11:$F$31,5,FALSE),0),\"\"))","v":""},null,{"$f":"IF($E19=\"\",\"\",IF((VLOOKUP($E19,Data!$A$11:$F$31,6,FALSE)=2),IF($E19=\"\",\"\",(IF(VLOOKUP($E19,Data!$A$11:$F$31,2,FALSE)*$F19<VLOOKUP($E19,Data!$A$11:$F$31,3,FALSE),VLOOKUP($E19,Data!$A$11:$F$31,3,FALSE),IF(VLOOKUP($E19,Data!$A$11:$F$31,2,FALSE)*$F19>VLOOKUP($E19,Data!$A$11:$F$31,4,FALSE),VLOOKUP($E19,Data!$A$11:$F$31,4,FALSE),ROUND(VLOOKUP($E19,Data!$A$11:$F$31,2,FALSE)*$F19,0))))),\"\"))","v":""},null,null,null,null,null,null,{"$f":"IF('Algemene gegevens'!$C17=\"\",\"\",'Algemene gegevens'!$C17)","v":""},{"$f":"IF('Algemene gegevens'!$D17=\"\",\"\",'Algemene gegevens'!$D17)","v":""},null,null,null,null,null,0,0,{"$f":"IF($F19=\"\",0,IF(VLOOKUP($E19,Data!$A$11:$F$31,6,FALSE)=1,1,0))","v":0},{"$f":"IF($F19=\"\",0,IF(VLOOKUP($E19,Data!$A$11:$F$31,6,FALSE)=2,1,0))","v":0},{"$f":"IF(E19=\"\",\"\",IF((VLOOKUP(E19,Data!$A$11:$F$31,6,FALSE)=1),ROUND(VLOOKUP($E19,Data!$A$11:$F$31,5,FALSE),0),IF((VLOOKUP(E19,Data!$A$11:$F$31,6,FALSE)=2),ROUND(VLOOKUP($E19,Data!$A$11:$F$31,5,FALSE),0),\"\")))","v":""},1,1,1,0,-1]
[null,null,{"$f":"IF('Algemene gegevens'!C18=\"\",\"\",'Algemene gegevens'!C18)","v":""},{"$f":"IF('Algemene gegevens'!D18=\"\",\"\",'Algemene gegevens'!D18)","v":""},{"$f":"IF('Algemene gegevens'!E18=\"\",\"\",'Algemene gegevens'!E18)","v":""},{"$f":"IF('Algemene gegevens'!F18=\"\",\"\",'Algemene gegevens'!F18)","v":""},{"$f":"IF(E20=\"\",\"\",IF((VLOOKUP(E20,Data!$A$11:$F$31,6,FALSE)=1),IF(E20=\"\",\"\",(IF(VLOOKUP(E20,Data!$A$11:$D$31,2,FALSE)*F20<VLOOKUP(E20,Data!$A$11:$D$31,3,FALSE),ROUND(VLOOKUP(E20,Data!$A$11:$D$31,3,FALSE),0),IF(VLOOKUP(E20,Data!$A$11:$D$31,2,FALSE)*F20>VLOOKUP(E20,Data!$A$11:$D$31,4,FALSE),ROUND(VLOOKUP(E20,Data!$A$11:$D$31,4,FALSE),0),ROUND(VLOOKUP(E20,Data!$A$11:$D$31,2,FALSE)*F20,0))))),\"\"))","v":""},null,55,{"$f":"IF(E20=\"\",\"\",IF((VLOOKUP(E20,Data!$A$11:$F$31,6,FALSE)=1),ROUND(VLOOKUP($E20,Data!$A$11:$F$31,5,FALSE),0),\"\"))","v":""},{"$f":"IF(E20=\"\",\"\",IF((VLOOKUP(E20,Data!$A$11:$F$31,6,FALSE)=2),ROUND(VLOOKUP($E20,Data!$A$11:$F$31,5,FALSE),0),\"\"))","v":""},null,{"$f":"IF($E20=\"\",\"\",IF((VLOOKUP($E20,Data!$A$11:$F$31,6,FALSE)=2),IF($E20=\"\",\"\",(IF(VLOOKUP($E20,Data!$A$11:$F$31,2,FALSE)*$F20<VLOOKUP($E20,Data!$A$11:$F$31,3,FALSE),VLOOKUP($E20,Data!$A$11:$F$31,3,FALSE),IF(VLOOKUP($E20,Data!$A$11:$F$31,2,FALSE)*$F20>VLOOKUP($E20,Data!$A$11:$F$31,4,FALSE),VLOOKUP($E20,Data!$A$11:$F$31,4,FALSE),ROUND(VLOOKUP($E20,Data!$A$11:$F$31,2,FALSE)*$F20,0))))),\"\"))","v":""},null,null,null,null,null,null,{"$f":"IF('Algemene gegevens'!$C18=\"\",\"\",'Algemene gegevens'!$C18)","v":""},{"$f":"IF('Algemene gegevens'!$D18=\"\",\"\",'Algemene gegevens'!$D18)","v":""},null,null,null,null,null,0,0,{"$f":"IF($F20=\"\",0,IF(VLOOKUP($E20,Data!$A$11:$F$31,6,FALSE)=1,1,0))","v":0},{"$f":"IF($F20=\"\",0,IF(VLOOKUP($E20,Data!$A$11:$F$31,6,FALSE)=2,1,0))","v":0},{"$f":"IF(E20=\"\",\"\",IF((VLOOKUP(E20,Data!$A$11:$F$31,6,FALSE)=1),ROUND(VLOOKUP($E20,Data!$A$11:$F$31,5,FALSE),0),IF((VLOOKUP(E20,Data!$A$11:$F$31,6,FALSE)=2),ROUND(VLOOKUP($E20,Data!$A$11:$F$31,5,FALSE),0),\"\")))","v":""},1,1,1,0,-1]
[null,null,{"$f":"IF('Algemene gegevens'!C19=\"\",\"\",'Algemene gegevens'!C19)","v":""},{"$f":"IF('Algemene gegevens'!D19=\"\",\"\",'Algemene gegevens'!D19)","v":""},{"$f":"IF('Algemene gegevens'!E19=\"\",\"\",'Algemene gegevens'!E19)","v":""},{"$f":"IF('Algemene gegevens'!F19=\"\",\"\",'Algemene gegevens'!F19)","v":""},{"$f":"IF(E21=\"\",\"\",IF((VLOOKUP(E21,Data!$A$11:$F$31,6,FALSE)=1),IF(E21=\"\",\"\",(IF(VLOOKUP(E21,Data!$A$11:$D$31,2,FALSE)*F21<VLOOKUP(E21,Data!$A$11:$D$31,3,FALSE),ROUND(VLOOKUP(E21,Data!$A$11:$D$31,3,FALSE),0),IF(VLOOKUP(E21,Data!$A$11:$D$31,2,FALSE)*F21>VLOOKUP(E21,Data!$A$11:$D$31,4,FALSE),ROUND(VLOOKUP(E21,Data!$A$11:$D$31,4,FALSE),0),ROUND(VLOOKUP(E21,Data!$A$11:$D$31,2,FALSE)*F21,0))))),\"\"))","v":""},null,null,{"$f":"IF(E21=\"\",\"\",IF((VLOOKUP(E21,Data!$A$11:$F$31,6,FALSE)=1),ROUND(VLOOKUP($E21,Data!$A$11:$F$31,5,FALSE),0),\"\"))","v":""},{"$f":"IF(E21=\"\",\"\",IF((VLOOKUP(E21,Data!$A$11:$F$31,6,FALSE)=2),ROUND(VLOOKUP($E21,Data!$A$11:$F$31,5,FALSE),0),\"\"))","v":""},null,{"$f":"IF($E21=\"\",\"\",IF((VLOOKUP($E21,Data!$A$11:$F$31,6,FALSE)=2),IF($E21=\"\",\"\",(IF(VLOOKUP($E21,Data!$A$11:$F$31,2,FALSE)*$F21<VLOOKUP($E21,Data!$A$11:$F$31,3,FALSE),VLOOKUP($E21,Data!$A$11:$F$31,3,FALSE),IF(VLOOKUP($E21,Data!$A$11:$F$31,2,FALSE)*$F21>VLOOKUP($E21,Data!$A$11:$F$31,4,FALSE),VLOOKUP($E21,Data!$A$11:$F$31,4,FALSE),ROUND(VLOOKUP($E21,Data!$A$11:$F$31,2,FALSE)*$F21,0))))),\"\"))","v":""},null,null,null,null,null,null,{"$f":"IF('Algemene gegevens'!$C19=\"\",\"\",'Algemene gegevens'!$C19)","v":""},{"$f":"IF('Algemene gegevens'!$D19=\"\",\"\",'Algemene gegevens'!$D19)","v":""},null,null,null,null,null,0,0,{"$f":"IF($F21=\"\",0,IF(VLOOKUP($E21,Data!$A$11:$F$31,6,FALSE)=1,1,0))","v":0},{"$f":"IF($F21=\"\",0,IF(VLOOKUP($E21,Data!$A$11:$F$31,6,FALSE)=2,1,0))","v":0},{"$f":"IF(E21=\"\",\"\",IF((VLOOKUP(E21,Data!$A$11:$F$31,6,FALSE)=1),ROUND(VLOOKUP($E21,Data!$A$11:$F$31,5,FALSE),0),IF((VLOOKUP(E21,Data!$A$11:$F$31,6,FALSE)=2),ROUND(VLOOKUP($E21,Data!$A$11:$F$31,5,FALSE),0),\"\")))","v":""},1,1,1,0,-1]
[null,null,{"$f":"IF('Algemene gegevens'!C20=\"\",\"\",'Algemene gegevens'!C20)","v":""},{"$f":"IF('Algemene gegevens'!D20=\"\",\"\",'Algemene gegevens'!D20)","v":""},{"$f":"IF('Algemene gegevens'!E20=\"\",\"\",'Algemene gegevens'!E20)","v":""},{"$f":"IF('Algemene gegevens'!F20=\"\",\"\",'Algemene gegevens'!F20)","v":""},{"$f":"IF(E22=\"\",\"\",IF((VLOOKUP(E22,Data!$A$11:$F$31,6,FALSE)=1),IF(E22=\"\",\"\",(IF(VLOOKUP(E22,Data!$A$11:$D$31,2,FALSE)*F22<VLOOKUP(E22,Data!$A$11:$D$31,3,FALSE),ROUND(VLOOKUP(E22,Data!$A$11:$D$31,3,FALSE),0),IF(VLOOKUP(E22,Data!$A$11:$D$31,2,FALSE)*F22>VLOOKUP(E22,Data!$A$11:$D$31,4,FALSE),ROUND(VLOOKUP(E22,Data!$A$11:$D$31,4,FALSE),0),ROUND(VLOOKUP(E22,Data!$A$11:$D$31,2,FALSE)*F22,0))))),\"\"))","v":""},null,56,{"$f":"IF(E22=\"\",\"\",IF((VLOOKUP(E22,Data!$A$11:$F$31,6,FALSE)=1),ROUND(VLOOKUP($E22,Data!$A$11:$F$31,5,FALSE),0),\"\"))","v":""},{"$f":"IF(E22=\"\",\"\",IF((VLOOKUP(E22,Data!$A$11:$F$31,6,FALSE)=2),ROUND(VLOOKUP($E22,Data!$A$11:$F$31,5,FALSE),0),\"\"))","v":""},null,{"$f":"IF($E22=\"\",\"\",IF((VLOOKUP($E22,Data!$A$11:$F$31,6,FALSE)=2),IF($E22=\"\",\"\",(IF(VLOOKUP($E22,Data!$A$11:$F$31,2,FALSE)*$F22<VLOOKUP($E22,Data!$A$11:$F$31,3,FALSE),VLOOKUP($E22,Data!$A$11:$F$31,3,FALSE),IF(VLOOKUP($E22,Data!$A$11:$F$31,2,FALSE)*$F22>VLOOKUP($E22,Data!$A$11:$F$31,4,FALSE),VLOOKUP($E22,Data!$A$11:$F$31,4,FALSE),ROUND(VLOOKUP($E22,Data!$A$11:$F$31,2,FALSE)*$F22,0))))),\"\"))","v":""},null,null,null,null,null,null,{"$f":"IF('Algemene gegevens'!$C20=\"\",\"\",'Algemene gegevens'!$C20)","v":""},{"$f":"IF('Algemene gegevens'!$D20=\"\",\"\",'Algemene gegevens'!$D20)","v":""},null,null,null,null,null,0,0,{"$f":"IF($F22=\"\",0,IF(VLOOKUP($E22,Data!$A$11:$F$31,6,FALSE)=1,1,0))","v":0},{"$f":"IF($F22=\"\",0,IF(VLOOKUP($E22,Data!$A$11:$F$31,6,FALSE)=2,1,0))","v":0},{"$f":"IF(E22=\"\",\"\",IF((VLOOKUP(E22,Data!$A$11:$F$31,6,FALSE)=1),ROUND(VLOOKUP($E22,Data!$A$11:$F$31,5,FALSE),0),IF((VLOOKUP(E22,Data!$A$11:$F$31,6,FALSE)=2),ROUND(VLOOKUP($E22,Data!$A$11:$F$31,5,FALSE),0),\"\")))","v":""},1,1,1,0,-1]
[null,null,{"$f":"IF('Algemene gegevens'!C21=\"\",\"\",'Algemene gegevens'!C21)","v":""},{"$f":"IF('Algemene gegevens'!D21=\"\",\"\",'Algemene gegevens'!D21)","v":""},{"$f":"IF('Algemene gegevens'!E21=\"\",\"\",'Algemene gegevens'!E21)","v":""},{"$f":"IF('Algemene gegevens'!F21=\"\",\"\",'Algemene gegevens'!F21)","v":""},{"$f":"IF(E23=\"\",\"\",IF((VLOOKUP(E23,Data!$A$11:$F$31,6,FALSE)=1),IF(E23=\"\",\"\",(IF(VLOOKUP(E23,Data!$A$11:$D$31,2,FALSE)*F23<VLOOKUP(E23,Data!$A$11:$D$31,3,FALSE),ROUND(VLOOKUP(E23,Data!$A$11:$D$31,3,FALSE),0),IF(VLOOKUP(E23,Data!$A$11:$D$31,2,FALSE)*F23>VLOOKUP(E23,Data!$A$11:$D$31,4,FALSE),ROUND(VLOOKUP(E23,Data!$A$11:$D$31,4,FALSE),0),ROUND(VLOOKUP(E23,Data!$A$11:$D$31,2,FALSE)*F23,0))))),\"\"))","v":""},null,55,{"$f":"IF(E23=\"\",\"\",IF((VLOOKUP(E23,Data!$A$11:$F$31,6,FALSE)=1),ROUND(VLOOKUP($E23,Data!$A$11:$F$31,5,FALSE),0),\"\"))","v":""},{"$f":"IF(E23=\"\",\"\",IF((VLOOKUP(E23,Data!$A$11:$F$31,6,FALSE)=2),ROUND(VLOOKUP($E23,Data!$A$11:$F$31,5,FALSE),0),\"\"))","v":""},null,{"$f":"IF($E23=\"\",\"\",IF((VLOOKUP($E23,Data!$A$11:$F$31,6,FALSE)=2),IF($E23=\"\",\"\",(IF(VLOOKUP($E23,Data!$A$11:$F$31,2,FALSE)*$F23<VLOOKUP($E23,Data!$A$11:$F$31,3,FALSE),VLOOKUP($E23,Data!$A$11:$F$31,3,FALSE),IF(VLOOKUP($E23,Data!$A$11:$F$31,2,FALSE)*$F23>VLOOKUP($E23,Data!$A$11:$F$31,4,FALSE),VLOOKUP($E23,Data!$A$11:$F$31,4,FALSE),ROUND(VLOOKUP($E23,Data!$A$11:$F$31,2,FALSE)*$F23,0))))),\"\"))","v":""},null,null,null,null,null,null,{"$f":"IF('Algemene gegevens'!$C21=\"\",\"\",'Algemene gegevens'!$C21)","v":""},{"$f":"IF('Algemene gegevens'!$D21=\"\",\"\",'Algemene gegevens'!$D21)","v":""},null,null,null,null,null,0,0,{"$f":"IF($F23=\"\",0,IF(VLOOKUP($E23,Data!$A$11:$F$31,6,FALSE)=1,1,0))","v":0},{"$f":"IF($F23=\"\",0,IF(VLOOKUP($E23,Data!$A$11:$F$31,6,FALSE)=2,1,0))","v":0},{"$f":"IF(E23=\"\",\"\",IF((VLOOKUP(E23,Data!$A$11:$F$31,6,FALSE)=1),ROUND(VLOOKUP($E23,Data!$A$11:$F$31,5,FALSE),0),IF((VLOOKUP(E23,Data!$A$11:$F$31,6,FALSE)=2),ROUND(VLOOKUP($E23,Data!$A$11:$F$31,5,FALSE),0),\"\")))","v":""},1,1,1,0,-1]
[null,null,{"$f":"IF('Algemene gegevens'!C22=\"\",\"\",'Algemene gegevens'!C22)","v":""},{"$f":"IF('Algemene gegevens'!D22=\"\",\"\",'Algemene gegevens'!D22)","v":""},{"$f":"IF('Algemene gegevens'!E22=\"\",\"\",'Algemene gegevens'!E22)","v":""},{"$f":"IF('Algemene gegevens'!F22=\"\",\"\",'Algemene gegevens'!F22)","v":""},{"$f":"IF(E24=\"\",\"\",IF((VLOOKUP(E24,Data!$A$11:$F$31,6,FALSE)=1),IF(E24=\"\",\"\",(IF(VLOOKUP(E24,Data!$A$11:$D$31,2,FALSE)*F24<VLOOKUP(E24,Data!$A$11:$D$31,3,FALSE),ROUND(VLOOKUP(E24,Data!$A$11:$D$31,3,FALSE),0),IF(VLOOKUP(E24,Data!$A$11:$D$31,2,FALSE)*F24>VLOOKUP(E24,Data!$A$11:$D$31,4,FALSE),ROUND(VLOOKUP(E24,Data!$A$11:$D$31,4,FALSE),0),ROUND(VLOOKUP(E24,Data!$A$11:$D$31,2,FALSE)*F24,0))))),\"\"))","v":""},null,null,{"$f":"IF(E24=\"\",\"\",IF((VLOOKUP(E24,Data!$A$11:$F$31,6,FALSE)=1),ROUND(VLOOKUP($E24,Data!$A$11:$F$31,5,FALSE),0),\"\"))","v":""},{"$f":"IF(E24=\"\",\"\",IF((VLOOKUP(E24,Data!$A$11:$F$31,6,FALSE)=2),ROUND(VLOOKUP($E24,Data!$A$11:$F$31,5,FALSE),0),\"\"))","v":""},null,{"$f":"IF($E24=\"\",\"\",IF((VLOOKUP($E24,Data!$A$11:$F$31,6,FALSE)=2),IF($E24=\"\",\"\",(IF(VLOOKUP($E24,Data!$A$11:$F$31,2,FALSE)*$F24<VLOOKUP($E24,Data!$A$11:$F$31,3,FALSE),VLOOKUP($E24,Data!$A$11:$F$31,3,FALSE),IF(VLOOKUP($E24,Data!$A$11:$F$31,2,FALSE)*$F24>VLOOKUP($E24,Data!$A$11:$F$31,4,FALSE),VLOOKUP($E24,Data!$A$11:$F$31,4,FALSE),ROUND(VLOOKUP($E24,Data!$A$11:$F$31,2,FALSE)*$F24,0))))),\"\"))","v":""},null,null,null,null,null,null,{"$f":"IF('Algemene gegevens'!$C22=\"\",\"\",'Algemene gegevens'!$C22)","v":""},{"$f":"IF('Algemene gegevens'!$D22=\"\",\"\",'Algemene gegevens'!$D22)","v":""},null,null,null,null,null,0,0,{"$f":"IF($F24=\"\",0,IF(VLOOKUP($E24,Data!$A$11:$F$31,6,FALSE)=1,1,0))","v":0},{"$f":"IF($F24=\"\",0,IF(VLOOKUP($E24,Data!$A$11:$F$31,6,FALSE)=2,1,0))","v":0},{"$f":"IF(E24=\"\",\"\",IF((VLOOKUP(E24,Data!$A$11:$F$31,6,FALSE)=1),ROUND(VLOOKUP($E24,Data!$A$11:$F$31,5,FALSE),0),IF((VLOOKUP(E24,Data!$A$11:$F$31,6,FALSE)=2),ROUND(VLOOKUP($E24,Data!$A$11:$F$31,5,FALSE),0),\"\")))","v":""},1,1,1,0,-1]
[null,null,{"$f":"IF('Algemene gegevens'!C23=\"\",\"\",'Algemene gegevens'!C23)","v":""},{"$f":"IF('Algemene gegevens'!D23=\"\",\"\",'Algemene gegevens'!D23)","v":""},{"$f":"IF('Algemene gegevens'!E23=\"\",\"\",'Algemene gegevens'!E23)","v":""},{"$f":"IF('Algemene gegevens'!F23=\"\",\"\",'Algemene gegevens'!F23)","v":""},{"$f":"IF(E25=\"\",\"\",IF((VLOOKUP(E25,Data!$A$11:$F$31,6,FALSE)=1),IF(E25=\"\",\"\",(IF(VLOOKUP(E25,Data!$A$11:$D$31,2,FALSE)*F25<VLOOKUP(E25,Data!$A$11:$D$31,3,FALSE),ROUND(VLOOKUP(E25,Data!$A$11:$D$31,3,FALSE),0),IF(VLOOKUP(E25,Data!$A$11:$D$31,2,FALSE)*F25>VLOOKUP(E25,Data!$A$11:$D$31,4,FALSE),ROUND(VLOOKUP(E25,Data!$A$11:$D$31,4,FALSE),0),ROUND(VLOOKUP(E25,Data!$A$11:$D$31,2,FALSE)*F25,0))))),\"\"))","v":""},null,null,{"$f":"IF(E25=\"\",\"\",IF((VLOOKUP(E25,Data!$A$11:$F$31,6,FALSE)=1),ROUND(VLOOKUP($E25,Data!$A$11:$F$31,5,FALSE),0),\"\"))","v":""},{"$f":"IF(E25=\"\",\"\",IF((VLOOKUP(E25,Data!$A$11:$F$31,6,FALSE)=2),ROUND(VLOOKUP($E25,Data!$A$11:$F$31,5,FALSE),0),\"\"))","v":""},null,{"$f":"IF($E25=\"\",\"\",IF((VLOOKUP($E25,Data!$A$11:$F$31,6,FALSE)=2),IF($E25=\"\",\"\",(IF(VLOOKUP($E25,Data!$A$11:$F$31,2,FALSE)*$F25<VLOOKUP($E25,Data!$A$11:$F$31,3,FALSE),VLOOKUP($E25,Data!$A$11:$F$31,3,FALSE),IF(VLOOKUP($E25,Data!$A$11:$F$31,2,FALSE)*$F25>VLOOKUP($E25,Data!$A$11:$F$31,4,FALSE),VLOOKUP($E25,Data!$A$11:$F$31,4,FALSE),ROUND(VLOOKUP($E25,Data!$A$11:$F$31,2,FALSE)*$F25,0))))),\"\"))","v":""},null,null,null,null,null,null,{"$f":"IF('Algemene gegevens'!$C23=\"\",\"\",'Algemene gegevens'!$C23)","v":""},{"$f":"IF('Algemene gegevens'!$D23=\"\",\"\",'Algemene gegevens'!$D23)","v":""},null,null,null,null,null,0,0,{"$f":"IF($F25=\"\",0,IF(VLOOKUP($E25,Data!$A$11:$F$31,6,FALSE)=1,1,0))","v":0},{"$f":"IF($F25=\"\",0,IF(VLOOKUP($E25,Data!$A$11:$F$31,6,FALSE)=2,1,0))","v":0},{"$f":"IF(E25=\"\",\"\",IF((VLOOKUP(E25,Data!$A$11:$F$31,6,FALSE)=1),ROUND(VLOOKUP($E25,Data!$A$11:$F$31,5,FALSE),0),IF((VLOOKUP(E25,Data!$A$11:$F$31,6,FALSE)=2),ROUND(VLOOKUP($E25,Data!$A$11:$F$31,5,FALSE),0),\"\")))","v":""},1,1,1,0,-1]
[null,null,{"$f":"IF('Algemene gegevens'!C24=\"\",\"\",'Algemene gegevens'!C24)","v":""},{"$f":"IF('Algemene gegevens'!D24=\"\",\"\",'Algemene gegevens'!D24)","v":""},{"$f":"IF('Algemene gegevens'!E24=\"\",\"\",'Algemene gegevens'!E24)","v":""},{"$f":"IF('Algemene gegevens'!F24=\"\",\"\",'Algemene gegevens'!F24)","v":""},{"$f":"IF(E26=\"\",\"\",IF((VLOOKUP(E26,Data!$A$11:$F$31,6,FALSE)=1),IF(E26=\"\",\"\",(IF(VLOOKUP(E26,Data!$A$11:$D$31,2,FALSE)*F26<VLOOKUP(E26,Data!$A$11:$D$31,3,FALSE),ROUND(VLOOKUP(E26,Data!$A$11:$D$31,3,FALSE),0),IF(VLOOKUP(E26,Data!$A$11:$D$31,2,FALSE)*F26>VLOOKUP(E26,Data!$A$11:$D$31,4,FALSE),ROUND(VLOOKUP(E26,Data!$A$11:$D$31,4,FALSE),0),ROUND(VLOOKUP(E26,Data!$A$11:$D$31,2,FALSE)*F26,0))))),\"\"))","v":""},null,null,{"$f":"IF(E26=\"\",\"\",IF((VLOOKUP(E26,Data!$A$11:$F$31,6,FALSE)=1),ROUND(VLOOKUP($E26,Data!$A$11:$F$31,5,FALSE),0),\"\"))","v":""},{"$f":"IF(E26=\"\",\"\",IF((VLOOKUP(E26,Data!$A$11:$F$31,6,FALSE)=2),ROUND(VLOOKUP($E26,Data!$A$11:$F$31,5,FALSE),0),\"\"))","v":""},null,{"$f":"IF($E26=\"\",\"\",IF((VLOOKUP($E26,Data!$A$11:$F$31,6,FALSE)=2),IF($E26=\"\",\"\",(IF(VLOOKUP($E26,Data!$A$11:$F$31,2,FALSE)*$F26<VLOOKUP($E26,Data!$A$11:$F$31,3,FALSE),VLOOKUP($E26,Data!$A$11:$F$31,3,FALSE),IF(VLOOKUP($E26,Data!$A$11:$F$31,2,FALSE)*$F26>VLOOKUP($E26,Data!$A$11:$F$31,4,FALSE),VLOOKUP($E26,Data!$A$11:$F$31,4,FALSE),ROUND(VLOOKUP($E26,Data!$A$11:$F$31,2,FALSE)*$F26,0))))),\"\"))","v":""},null,null,null,null,null,null,{"$f":"IF('Algemene gegevens'!$C24=\"\",\"\",'Algemene gegevens'!$C24)","v":""},{"$f":"IF('Algemene gegevens'!$D24=\"\",\"\",'Algemene gegevens'!$D24)","v":""},null,null,null,null,null,0,0,{"$f":"IF($F26=\"\",0,IF(VLOOKUP($E26,Data!$A$11:$F$31,6,FALSE)=1,1,0))","v":0},{"$f":"IF($F26=\"\",0,IF(VLOOKUP($E26,Data!$A$11:$F$31,6,FALSE)=2,1,0))","v":0},{"$f":"IF(E26=\"\",\"\",IF((VLOOKUP(E26,Data!$A$11:$F$31,6,FALSE)=1),ROUND(VLOOKUP($E26,Data!$A$11:$F$31,5,FALSE),0),IF((VLOOKUP(E26,Data!$A$11:$F$31,6,FALSE)=2),ROUND(VLOOKUP($E26,Data!$A$11:$F$31,5,FALSE),0),\"\")))","v":""},1,1,1,0,-1]
[null,null,{"$f":"IF('Algemene gegevens'!C25=\"\",\"\",'Algemene gegevens'!C25)","v":""},{"$f":"IF('Algemene gegevens'!D25=\"\",\"\",'Algemene gegevens'!D25)","v":""},{"$f":"IF('Algemene gegevens'!E25=\"\",\"\",'Algemene gegevens'!E25)","v":""},{"$f":"IF('Algemene gegevens'!F25=\"\",\"\",'Algemene gegevens'!F25)","v":""},{"$f":"IF(E27=\"\",\"\",IF((VLOOKUP(E27,Data!$A$11:$F$31,6,FALSE)=1),IF(E27=\"\",\"\",(IF(VLOOKUP(E27,Data!$A$11:$D$31,2,FALSE)*F27<VLOOKUP(E27,Data!$A$11:$D$31,3,FALSE),ROUND(VLOOKUP(E27,Data!$A$11:$D$31,3,FALSE),0),IF(VLOOKUP(E27,Data!$A$11:$D$31,2,FALSE)*F27>VLOOKUP(E27,Data!$A$11:$D$31,4,FALSE),ROUND(VLOOKUP(E27,Data!$A$11:$D$31,4,FALSE),0),ROUND(VLOOKUP(E27,Data!$A$11:$D$31,2,FALSE)*F27,0))))),\"\"))","v":""},null,null,{"$f":"IF(E27=\"\",\"\",IF((VLOOKUP(E27,Data!$A$11:$F$31,6,FALSE)=1),ROUND(VLOOKUP($E27,Data!$A$11:$F$31,5,FALSE),0),\"\"))","v":""},{"$f":"IF(E27=\"\",\"\",IF((VLOOKUP(E27,Data!$A$11:$F$31,6,FALSE)=2),ROUND(VLOOKUP($E27,Data!$A$11:$F$31,5,FALSE),0),\"\"))","v":""},null,{"$f":"IF($E27=\"\",\"\",IF((VLOOKUP($E27,Data!$A$11:$F$31,6,FALSE)=2),IF($E27=\"\",\"\",(IF(VLOOKUP($E27,Data!$A$11:$F$31,2,FALSE)*$F27<VLOOKUP($E27,Data!$A$11:$F$31,3,FALSE),VLOOKUP($E27,Data!$A$11:$F$31,3,FALSE),IF(VLOOKUP($E27,Data!$A$11:$F$31,2,FALSE)*$F27>VLOOKUP($E27,Data!$A$11:$F$31,4,FALSE),VLOOKUP($E27,Data!$A$11:$F$31,4,FALSE),ROUND(VLOOKUP($E27,Data!$A$11:$F$31,2,FALSE)*$F27,0))))),\"\"))","v":""},null,null,null,null,null,null,{"$f":"IF('Algemene gegevens'!$C25=\"\",\"\",'Algemene gegevens'!$C25)","v":""},{"$f":"IF('Algemene gegevens'!$D25=\"\",\"\",'Algemene gegevens'!$D25)","v":""},null,null,null,null,null,0,0,{"$f":"IF($F27=\"\",0,IF(VLOOKUP($E27,Data!$A$11:$F$31,6,FALSE)=1,1,0))","v":0},{"$f":"IF($F27=\"\",0,IF(VLOOKUP($E27,Data!$A$11:$F$31,6,FALSE)=2,1,0))","v":0},{"$f":"IF(E27=\"\",\"\",IF((VLOOKUP(E27,Data!$A$11:$F$31,6,FALSE)=1),ROUND(VLOOKUP($E27,Data!$A$11:$F$31,5,FALSE),0),IF((VLOOKUP(E27,Data!$A$11:$F$31,6,FALSE)=2),ROUND(VLOOKUP($E27,Data!$A$11:$F$31,5,FALSE),0),\"\")))","v":""},1,1,1,0,-1]
[null,null,{"$f":"IF('Algemene gegevens'!C26=\"\",\"\",'Algemene gegevens'!C26)","v":""},{"$f":"IF('Algemene gegevens'!D26=\"\",\"\",'Algemene gegevens'!D26)","v":""},{"$f":"IF('Algemene gegevens'!E26=\"\",\"\",'Algemene gegevens'!E26)","v":""},{"$f":"IF('Algemene gegevens'!F26=\"\",\"\",'Algemene gegevens'!F26)","v":""},{"$f":"IF(E28=\"\",\"\",IF((VLOOKUP(E28,Data!$A$11:$F$31,6,FALSE)=1),IF(E28=\"\",\"\",(IF(VLOOKUP(E28,Data!$A$11:$D$31,2,FALSE)*F28<VLOOKUP(E28,Data!$A$11:$D$31,3,FALSE),ROUND(VLOOKUP(E28,Data!$A$11:$D$31,3,FALSE),0),IF(VLOOKUP(E28,Data!$A$11:$D$31,2,FALSE)*F28>VLOOKUP(E28,Data!$A$11:$D$31,4,FALSE),ROUND(VLOOKUP(E28,Data!$A$11:$D$31,4,FALSE),0),ROUND(VLOOKUP(E28,Data!$A$11:$D$31,2,FALSE)*F28,0))))),\"\"))","v":""},null,null,{"$f":"IF(E28=\"\",\"\",IF((VLOOKUP(E28,Data!$A$11:$F$31,6,FALSE)=1),ROUND(VLOOKUP($E28,Data!$A$11:$F$31,5,FALSE),0),\"\"))","v":""},{"$f":"IF(E28=\"\",\"\",IF((VLOOKUP(E28,Data!$A$11:$F$31,6,FALSE)=2),ROUND(VLOOKUP($E28,Data!$A$11:$F$31,5,FALSE),0),\"\"))","v":""},null,{"$f":"IF($E28=\"\",\"\",IF((VLOOKUP($E28,Data!$A$11:$F$31,6,FALSE)=2),IF($E28=\"\",\"\",(IF(VLOOKUP($E28,Data!$A$11:$F$31,2,FALSE)*$F28<VLOOKUP($E28,Data!$A$11:$F$31,3,FALSE),VLOOKUP($E28,Data!$A$11:$F$31,3,FALSE),IF(VLOOKUP($E28,Data!$A$11:$F$31,2,FALSE)*$F28>VLOOKUP($E28,Data!$A$11:$F$31,4,FALSE),VLOOKUP($E28,Data!$A$11:$F$31,4,FALSE),ROUND(VLOOKUP($E28,Data!$A$11:$F$31,2,FALSE)*$F28,0))))),\"\"))","v":""},null,null,null,null,null,null,{"$f":"IF('Algemene gegevens'!$C26=\"\",\"\",'Algemene gegevens'!$C26)","v":""},{"$f":"IF('Algemene gegevens'!$D26=\"\",\"\",'Algemene gegevens'!$D26)","v":""},null,null,null,null,null,0,0,{"$f":"IF($F28=\"\",0,IF(VLOOKUP($E28,Data!$A$11:$F$31,6,FALSE)=1,1,0))","v":0},{"$f":"IF($F28=\"\",0,IF(VLOOKUP($E28,Data!$A$11:$F$31,6,FALSE)=2,1,0))","v":0},{"$f":"IF(E28=\"\",\"\",IF((VLOOKUP(E28,Data!$A$11:$F$31,6,FALSE)=1),ROUND(VLOOKUP($E28,Data!$A$11:$F$31,5,FALSE),0),IF((VLOOKUP(E28,Data!$A$11:$F$31,6,FALSE)=2),ROUND(VLOOKUP($E28,Data!$A$11:$F$31,5,FALSE),0),\"\")))","v":""},1,1,1,0,-1]
[null,null,{"$f":"IF('Algemene gegevens'!C27=\"\",\"\",'Algemene gegevens'!C27)","v":""},{"$f":"IF('Algemene gegevens'!D27=\"\",\"\",'Algemene gegevens'!D27)","v":""},{"$f":"IF('Algemene gegevens'!E27=\"\",\"\",'Algemene gegevens'!E27)","v":""},{"$f":"IF('Algemene gegevens'!F27=\"\",\"\",'Algemene gegevens'!F27)","v":""},{"$f":"IF(E29=\"\",\"\",IF((VLOOKUP(E29,Data!$A$11:$F$31,6,FALSE)=1),IF(E29=\"\",\"\",(IF(VLOOKUP(E29,Data!$A$11:$D$31,2,FALSE)*F29<VLOOKUP(E29,Data!$A$11:$D$31,3,FALSE),ROUND(VLOOKUP(E29,Data!$A$11:$D$31,3,FALSE),0),IF(VLOOKUP(E29,Data!$A$11:$D$31,2,FALSE)*F29>VLOOKUP(E29,Data!$A$11:$D$31,4,FALSE),ROUND(VLOOKUP(E29,Data!$A$11:$D$31,4,FALSE),0),ROUND(VLOOKUP(E29,Data!$A$11:$D$31,2,FALSE)*F29,0))))),\"\"))","v":""},null,null,{"$f":"IF(E29=\"\",\"\",IF((VLOOKUP(E29,Data!$A$11:$F$31,6,FALSE)=1),ROUND(VLOOKUP($E29,Data!$A$11:$F$31,5,FALSE),0),\"\"))","v":""},{"$f":"IF(E29=\"\",\"\",IF((VLOOKUP(E29,Data!$A$11:$F$31,6,FALSE)=2),ROUND(VLOOKUP($E29,Data!$A$11:$F$31,5,FALSE),0),\"\"))","v":""},null,{"$f":"IF($E29=\"\",\"\",IF((VLOOKUP($E29,Data!$A$11:$F$31,6,FALSE)=2),IF($E29=\"\",\"\",(IF(VLOOKUP($E29,Data!$A$11:$F$31,2,FALSE)*$F29<VLOOKUP($E29,Data!$A$11:$F$31,3,FALSE),VLOOKUP($E29,Data!$A$11:$F$31,3,FALSE),IF(VLOOKUP($E29,Data!$A$11:$F$31,2,FALSE)*$F29>VLOOKUP($E29,Data!$A$11:$F$31,4,FALSE),VLOOKUP($E29,Data!$A$11:$F$31,4,FALSE),ROUND(VLOOKUP($E29,Data!$A$11:$F$31,2,FALSE)*$F29,0))))),\"\"))","v":""},null,null,null,null,null,null,{"$f":"IF('Algemene gegevens'!$C27=\"\",\"\",'Algemene gegevens'!$C27)","v":""},{"$f":"IF('Algemene gegevens'!$D27=\"\",\"\",'Algemene gegevens'!$D27)","v":""},null,null,null,null,null,0,0,{"$f":"IF($F29=\"\",0,IF(VLOOKUP($E29,Data!$A$11:$F$31,6,FALSE)=1,1,0))","v":0},{"$f":"IF($F29=\"\",0,IF(VLOOKUP($E29,Data!$A$11:$F$31,6,FALSE)=2,1,0))","v":0},{"$f":"IF(E29=\"\",\"\",IF((VLOOKUP(E29,Data!$A$11:$F$31,6,FALSE)=1),ROUND(VLOOKUP($E29,Data!$A$11:$F$31,5,FALSE),0),IF((VLOOKUP(E29,Data!$A$11:$F$31,6,FALSE)=2),ROUND(VLOOKUP($E29,Data!$A$11:$F$31,5,FALSE),0),\"\")))","v":""},1,1,1,0,-1]
[null,null,{"$f":"IF('Algemene gegevens'!C28=\"\",\"\",'Algemene gegevens'!C28)","v":""},{"$f":"IF('Algemene gegevens'!D28=\"\",\"\",'Algemene gegevens'!D28)","v":""},{"$f":"IF('Algemene gegevens'!E28=\"\",\"\",'Algemene gegevens'!E28)","v":""},{"$f":"IF('Algemene gegevens'!F28=\"\",\"\",'Algemene gegevens'!F28)","v":""},{"$f":"IF(E30=\"\",\"\",IF((VLOOKUP(E30,Data!$A$11:$F$31,6,FALSE)=1),IF(E30=\"\",\"\",(IF(VLOOKUP(E30,Data!$A$11:$D$31,2,FALSE)*F30<VLOOKUP(E30,Data!$A$11:$D$31,3,FALSE),ROUND(VLOOKUP(E30,Data!$A$11:$D$31,3,FALSE),0),IF(VLOOKUP(E30,Data!$A$11:$D$31,2,FALSE)*F30>VLOOKUP(E30,Data!$A$11:$D$31,4,FALSE),ROUND(VLOOKUP(E30,Data!$A$11:$D$31,4,FALSE),0),ROUND(VLOOKUP(E30,Data!$A$11:$D$31,2,FALSE)*F30,0))))),\"\"))","v":""},null,null,{"$f":"IF(E30=\"\",\"\",IF((VLOOKUP(E30,Data!$A$11:$F$31,6,FALSE)=1),ROUND(VLOOKUP($E30,Data!$A$11:$F$31,5,FALSE),0),\"\"))","v":""},{"$f":"IF(E30=\"\",\"\",IF((VLOOKUP(E30,Data!$A$11:$F$31,6,FALSE)=2),ROUND(VLOOKUP($E30,Data!$A$11:$F$31,5,FALSE),0),\"\"))","v":""},null,{"$f":"IF($E30=\"\",\"\",IF((VLOOKUP($E30,Data!$A$11:$F$31,6,FALSE)=2),IF($E30=\"\",\"\",(IF(VLOOKUP($E30,Data!$A$11:$F$31,2,FALSE)*$F30<VLOOKUP($E30,Data!$A$11:$F$31,3,FALSE),VLOOKUP($E30,Data!$A$11:$F$31,3,FALSE),IF(VLOOKUP($E30,Data!$A$11:$F$31,2,FALSE)*$F30>VLOOKUP($E30,Data!$A$11:$F$31,4,FALSE),VLOOKUP($E30,Data!$A$11:$F$31,4,FALSE),ROUND(VLOOKUP($E30,Data!$A$11:$F$31,2,FALSE)*$F30,0))))),\"\"))","v":""},null,null,null,null,null,null,{"$f":"IF('Algemene gegevens'!$C28=\"\",\"\",'Algemene gegevens'!$C28)","v":""},{"$f":"IF('Algemene gegevens'!$D28=\"\",\"\",'Algemene gegevens'!$D28)","v":""},null,null,null,null,null,0,0,{"$f":"IF($F30=\"\",0,IF(VLOOKUP($E30,Data!$A$11:$F$31,6,FALSE)=1,1,0))","v":0},{"$f":"IF($F30=\"\",0,IF(VLOOKUP($E30,Data!$A$11:$F$31,6,FALSE)=2,1,0))","v":0},{"$f":"IF(E30=\"\",\"\",IF((VLOOKUP(E30,Data!$A$11:$F$31,6,FALSE)=1),ROUND(VLOOKUP($E30,Data!$A$11:$F$31,5,FALSE),0),IF((VLOOKUP(E30,Data!$A$11:$F$31,6,FALSE)=2),ROUND(VLOOKUP($E30,Data!$A$11:$F$31,5,FALSE),0),\"\")))","v":""},1,1,1,0,-1]
[null,null,{"$f":"IF('Algemene gegevens'!C29=\"\",\"\",'Algemene gegevens'!C29)","v":""},{"$f":"IF('Algemene gegevens'!D29=\"\",\"\",'Algemene gegevens'!D29)","v":""},{"$f":"IF('Algemene gegevens'!E29=\"\",\"\",'Algemene gegevens'!E29)","v":""},{"$f":"IF('Algemene gegevens'!F29=\"\",\"\",'Algemene gegevens'!F29)","v":""},{"$f":"IF(E31=\"\",\"\",IF((VLOOKUP(E31,Data!$A$11:$F$31,6,FALSE)=1),IF(E31=\"\",\"\",(IF(VLOOKUP(E31,Data!$A$11:$D$31,2,FALSE)*F31<VLOOKUP(E31,Data!$A$11:$D$31,3,FALSE),ROUND(VLOOKUP(E31,Data!$A$11:$D$31,3,FALSE),0),IF(VLOOKUP(E31,Data!$A$11:$D$31,2,FALSE)*F31>VLOOKUP(E31,Data!$A$11:$D$31,4,FALSE),ROUND(VLOOKUP(E31,Data!$A$11:$D$31,4,FALSE),0),ROUND(VLOOKUP(E31,Data!$A$11:$D$31,2,FALSE)*F31,0))))),\"\"))","v":""},null,null,{"$f":"IF(E31=\"\",\"\",IF((VLOOKUP(E31,Data!$A$11:$F$31,6,FALSE)=1),ROUND(VLOOKUP($E31,Data!$A$11:$F$31,5,FALSE),0),\"\"))","v":""},{"$f":"IF(E31=\"\",\"\",IF((VLOOKUP(E31,Data!$A$11:$F$31,6,FALSE)=2),ROUND(VLOOKUP($E31,Data!$A$11:$F$31,5,FALSE),0),\"\"))","v":""},null,{"$f":"IF($E31=\"\",\"\",IF((VLOOKUP($E31,Data!$A$11:$F$31,6,FALSE)=2),IF($E31=\"\",\"\",(IF(VLOOKUP($E31,Data!$A$11:$F$31,2,FALSE)*$F31<VLOOKUP($E31,Data!$A$11:$F$31,3,FALSE),VLOOKUP($E31,Data!$A$11:$F$31,3,FALSE),IF(VLOOKUP($E31,Data!$A$11:$F$31,2,FALSE)*$F31>VLOOKUP($E31,Data!$A$11:$F$31,4,FALSE),VLOOKUP($E31,Data!$A$11:$F$31,4,FALSE),ROUND(VLOOKUP($E31,Data!$A$11:$F$31,2,FALSE)*$F31,0))))),\"\"))","v":""},null,null,null,null,null,null,{"$f":"IF('Algemene gegevens'!$C29=\"\",\"\",'Algemene gegevens'!$C29)","v":""},{"$f":"IF('Algemene gegevens'!$D29=\"\",\"\",'Algemene gegevens'!$D29)","v":""},null,null,null,null,null,0,0,{"$f":"IF($F31=\"\",0,IF(VLOOKUP($E31,Data!$A$11:$F$31,6,FALSE)=1,1,0))","v":0},{"$f":"IF($F31=\"\",0,IF(VLOOKUP($E31,Data!$A$11:$F$31,6,FALSE)=2,1,0))","v":0},{"$f":"IF(E31=\"\",\"\",IF((VLOOKUP(E31,Data!$A$11:$F$31,6,FALSE)=1),ROUND(VLOOKUP($E31,Data!$A$11:$F$31,5,FALSE),0),IF((VLOOKUP(E31,Data!$A$11:$F$31,6,FALSE)=2),ROUND(VLOOKUP($E31,Data!$A$11:$F$31,5,FALSE),0),\"\")))","v":""},1,1,1,0,-1]
[null,null,{"$f":"IF('Algemene gegevens'!C30=\"\",\"\",'Algemene gegevens'!C30)","v":""},{"$f":"IF('Algemene gegevens'!D30=\"\",\"\",'Algemene gegevens'!D30)","v":""},{"$f":"IF('Algemene gegevens'!E30=\"\",\"\",'Algemene gegevens'!E30)","v":""},{"$f":"IF('Algemene gegevens'!F30=\"\",\"\",'Algemene gegevens'!F30)","v":""},{"$f":"IF(E32=\"\",\"\",IF((VLOOKUP(E32,Data!$A$11:$F$31,6,FALSE)=1),IF(E32=\"\",\"\",(IF(VLOOKUP(E32,Data!$A$11:$D$31,2,FALSE)*F32<VLOOKUP(E32,Data!$A$11:$D$31,3,FALSE),ROUND(VLOOKUP(E32,Data!$A$11:$D$31,3,FALSE),0),IF(VLOOKUP(E32,Data!$A$11:$D$31,2,FALSE)*F32>VLOOKUP(E32,Data!$A$11:$D$31,4,FALSE),ROUND(VLOOKUP(E32,Data!$A$11:$D$31,4,FALSE),0),ROUND(VLOOKUP(E32,Data!$A$11:$D$31,2,FALSE)*F32,0))))),\"\"))","v":""},null,null,{"$f":"IF(E32=\"\",\"\",IF((VLOOKUP(E32,Data!$A$11:$F$31,6,FALSE)=1),ROUND(VLOOKUP($E32,Data!$A$11:$F$31,5,FALSE),0),\"\"))","v":""},{"$f":"IF(E32=\"\",\"\",IF((VLOOKUP(E32,Data!$A$11:$F$31,6,FALSE)=2),ROUND(VLOOKUP($E32,Data!$A$11:$F$31,5,FALSE),0),\"\"))","v":""},null,{"$f":"IF($E32=\"\",\"\",IF((VLOOKUP($E32,Data!$A$11:$F$31,6,FALSE)=2),IF($E32=\"\",\"\",(IF(VLOOKUP($E32,Data!$A$11:$F$31,2,FALSE)*$F32<VLOOKUP($E32,Data!$A$11:$F$31,3,FALSE),VLOOKUP($E32,Data!$A$11:$F$31,3,FALSE),IF(VLOOKUP($E32,Data!$A$11:$F$31,2,FALSE)*$F32>VLOOKUP($E32,Data!$A$11:$F$31,4,FALSE),VLOOKUP($E32,Data!$A$11:$F$31,4,FALSE),ROUND(VLOOKUP($E32,Data!$A$11:$F$31,2,FALSE)*$F32,0))))),\"\"))","v":""},null,null,null,null,null,null,{"$f":"IF('Algemene gegevens'!$C30=\"\",\"\",'Algemene gegevens'!$C30)","v":""},{"$f":"IF('Algemene gegevens'!$D30=\"\",\"\",'Algemene gegevens'!$D30)","v":""},null,null,null,null,null,0,0,{"$f":"IF($F32=\"\",0,IF(VLOOKUP($E32,Data!$A$11:$F$31,6,FALSE)=1,1,0))","v":0},{"$f":"IF($F32=\"\",0,IF(VLOOKUP($E32,Data!$A$11:$F$31,6,FALSE)=2,1,0))","v":0},{"$f":"IF(E32=\"\",\"\",IF((VLOOKUP(E32,Data!$A$11:$F$31,6,FALSE)=1),ROUND(VLOOKUP($E32,Data!$A$11:$F$31,5,FALSE),0),IF((VLOOKUP(E32,Data!$A$11:$F$31,6,FALSE)=2),ROUND(VLOOKUP($E32,Data!$A$11:$F$31,5,FALSE),0),\"\")))","v":""},1,1,1,0,-1]
[null,null,{"$f":"IF('Algemene gegevens'!C31=\"\",\"\",'Algemene gegevens'!C31)","v":""},{"$f":"IF('Algemene gegevens'!D31=\"\",\"\",'Algemene gegevens'!D31)","v":""},{"$f":"IF('Algemene gegevens'!E31=\"\",\"\",'Algemene gegevens'!E31)","v":""},{"$f":"IF('Algemene gegevens'!F31=\"\",\"\",'Algemene gegevens'!F31)","v":""},{"$f":"IF(E33=\"\",\"\",IF((VLOOKUP(E33,Data!$A$11:$F$31,6,FALSE)=1),IF(E33=\"\",\"\",(IF(VLOOKUP(E33,Data!$A$11:$D$31,2,FALSE)*F33<VLOOKUP(E33,Data!$A$11:$D$31,3,FALSE),ROUND(VLOOKUP(E33,Data!$A$11:$D$31,3,FALSE),0),IF(VLOOKUP(E33,Data!$A$11:$D$31,2,FALSE)*F33>VLOOKUP(E33,Data!$A$11:$D$31,4,FALSE),ROUND(VLOOKUP(E33,Data!$A$11:$D$31,4,FALSE),0),ROUND(VLOOKUP(E33,Data!$A$11:$D$31,2,FALSE)*F33,0))))),\"\"))","v":""},null,null,{"$f":"IF(E33=\"\",\"\",IF((VLOOKUP(E33,Data!$A$11:$F$31,6,FALSE)=1),ROUND(VLOOKUP($E33,Data!$A$11:$F$31,5,FALSE),0),\"\"))","v":""},{"$f":"IF(E33=\"\",\"\",IF((VLOOKUP(E33,Data!$A$11:$F$31,6,FALSE)=2),ROUND(VLOOKUP($E33,Data!$A$11:$F$31,5,FALSE),0),\"\"))","v":""},null,{"$f":"IF($E33=\"\",\"\",IF((VLOOKUP($E33,Data!$A$11:$F$31,6,FALSE)=2),IF($E33=\"\",\"\",(IF(VLOOKUP($E33,Data!$A$11:$F$31,2,FALSE)*$F33<VLOOKUP($E33,Data!$A$11:$F$31,3,FALSE),VLOOKUP($E33,Data!$A$11:$F$31,3,FALSE),IF(VLOOKUP($E33,Data!$A$11:$F$31,2,FALSE)*$F33>VLOOKUP($E33,Data!$A$11:$F$31,4,FALSE),VLOOKUP($E33,Data!$A$11:$F$31,4,FALSE),ROUND(VLOOKUP($E33,Data!$A$11:$F$31,2,FALSE)*$F33,0))))),\"\"))","v":""},null,null,null,null,null,null,{"$f":"IF('Algemene gegevens'!$C31=\"\",\"\",'Algemene gegevens'!$C31)","v":""},{"$f":"IF('Algemene gegevens'!$D31=\"\",\"\",'Algemene gegevens'!$D31)","v":""},null,null,null,null,null,0,0,{"$f":"IF($F33=\"\",0,IF(VLOOKUP($E33,Data!$A$11:$F$31,6,FALSE)=1,1,0))","v":0},{"$f":"IF($F33=\"\",0,IF(VLOOKUP($E33,Data!$A$11:$F$31,6,FALSE)=2,1,0))","v":0},{"$f":"IF(E33=\"\",\"\",IF((VLOOKUP(E33,Data!$A$11:$F$31,6,FALSE)=1),ROUND(VLOOKUP($E33,Data!$A$11:$F$31,5,FALSE),0),IF((VLOOKUP(E33,Data!$A$11:$F$31,6,FALSE)=2),ROUND(VLOOKUP($E33,Data!$A$11:$F$31,5,FALSE),0),\"\")))","v":""},1,1,1,0,-1]
[null,null,{"$f":"IF('Algemene gegevens'!C32=\"\",\"\",'Algemene gegevens'!C32)","v":""},{"$f":"IF('Algemene gegevens'!D32=\"\",\"\",'Algemene gegevens'!D32)","v":""},{"$f":"IF('Algemene gegevens'!E32=\"\",\"\",'Algemene gegevens'!E32)","v":""},{"$f":"IF('Algemene gegevens'!F32=\"\",\"\",'Algemene gegevens'!F32)","v":""},{"$f":"IF(E34=\"\",\"\",IF((VLOOKUP(E34,Data!$A$11:$F$31,6,FALSE)=1),IF(E34=\"\",\"\",(IF(VLOOKUP(E34,Data!$A$11:$D$31,2,FALSE)*F34<VLOOKUP(E34,Data!$A$11:$D$31,3,FALSE),ROUND(VLOOKUP(E34,Data!$A$11:$D$31,3,FALSE),0),IF(VLOOKUP(E34,Data!$A$11:$D$31,2,FALSE)*F34>VLOOKUP(E34,Data!$A$11:$D$31,4,FALSE),ROUND(VLOOKUP(E34,Data!$A$11:$D$31,4,FALSE),0),ROUND(VLOOKUP(E34,Data!$A$11:$D$31,2,FALSE)*F34,0))))),\"\"))","v":""},null,null,null,{"$f":"IF(E34=\"\",\"\",IF((VLOOKUP(E34,Data!$A$11:$F$31,6,FALSE)=2),ROUND(VLOOKUP($E34,Data!$A$11:$F$31,5,FALSE),0),\"\"))","v":""},null,{"$f":"IF($E34=\"\",\"\",IF((VLOOKUP($E34,Data!$A$11:$F$31,6,FALSE)=2),IF($E34=\"\",\"\",(IF(VLOOKUP($E34,Data!$A$11:$F$31,2,FALSE)*$F34<VLOOKUP($E34,Data!$A$11:$F$31,3,FALSE),VLOOKUP($E34,Data!$A$11:$F$31,3,FALSE),IF(VLOOKUP($E34,Data!$A$11:$F$31,2,FALSE)*$F34>VLOOKUP($E34,Data!$A$11:$F$31,4,FALSE),VLOOKUP($E34,Data!$A$11:$F$31,4,FALSE),ROUND(VLOOKUP($E34,Data!$A$11:$F$31,2,FALSE)*$F34,0))))),\"\"))","v":""},null,null,null,null,null,null,{"$f":"IF('Algemene gegevens'!$C32=\"\",\"\",'Algemene gegevens'!$C32)","v":""},{"$f":"IF('Algemene gegevens'!$D32=\"\",\"\",'Algemene gegevens'!$D32)","v":""},null,null,null,null,null,0,0,{"$f":"IF($F34=\"\",0,IF(VLOOKUP($E34,Data!$A$11:$F$31,6,FALSE)=1,1,0))","v":0},{"$f":"IF($F34=\"\",0,IF(VLOOKUP($E34,Data!$A$11:$F$31,6,FALSE)=2,1,0))","v":0},{"$f":"IF(E34=\"\",\"\",IF((VLOOKUP(E34,Data!$A$11:$F$31,6,FALSE)=1),ROUND(VLOOKUP($E34,Data!$A$11:$F$31,5,FALSE),0),IF((VLOOKUP(E34,Data!$A$11:$F$31,6,FALSE)=2),ROUND(VLOOKUP($E34,Data!$A$11:$F$31,5,FALSE),0),\"\")))","v":""},1,1,1,0,-1]
[null,null,null,null,null,"totalen",{"$f":"SUM(G14:G34)","v":0},{"$f":"SUMPRODUCT(H14:H34,AA14:AA34)","v":0},{"$f":"IF(I9=\"ja\",SUMPRODUCT(I14:I34,AI14:AI34),\"\")","v":0},null,null,null,{"$f":"SUM(M14:M34)","v":0},{"$f":"SUMPRODUCT(N14:N34,AA14:AA34)","v":0},null,null,null,null,null,null,null,null,null,null,null,null,null,null,null,null,null,null,null,null,null,{"$f":"MAX(AJ14:AJ34)","v":-1}]
[]
[null,null,null,null,null,null,null,null,{"$f":"SUMPRODUCT(AB14:AB34,I14:I34)","v":0},null,{"$f":"SUM(J35+K35)","v":0}]
[]
[]
[]
[null,null,"Lekdebieten kanalen"]
[null,null,null,null,null,null,null,null,null,null,null,null,null,"(m³/h)"]
[null,null,"Lekdebiet toevoerkanalen",null,null,null,null,null,null,null,null,null,"lekdebietsmeting?","ja"]
[null,null,null,null,null,null,null,null,null,null,null,null,null,null,null,null,null,null,null,null,null,null,null,null,null,null,null,null,null,null,"druk na de ventilator (Pa)",null,null,null,null,null,"hoort tot stavingsstuk"]
[null,null,null,null,null,null,null,null,null,null,null,null,"ontstenteniswaarde",{"$f":"IF($AD$4=\"A\",\"geen\",IF($AD$4=\"B\",0.18*G35,IF($AD$4=\"C\",\"geen\",0.18*G35)))","v":0}]
[null,null,null,null,null,null,null,null,null,null,null,null,"maximaal gewenste waarde"]
[null,null,null,null,null,null,null,null,null,null,null,null,"gemeten:"]
[]
[null,null,"Lekdebiet afvoerkanalen",null,null,null,null,null,null,null,null,null,"lekdebietsmeting?","ja"]
[null,null,null,null,null,null,null,null,null,null,null,null,null,null,null,null,null,null,null,null,null,null,null,null,null,null,null,null,null,null,"druk voor de ventilator (Pa)",null,null,null,null,null,"hoort tot stavingsstuk"]
[null,null,null,null,null,null,null,null,null,null,null,null,"ontstenteniswaarde",{"$f":"IF($AD$4=\"A\",0.025*M35,IF($AD$4=\"B\",0.025*M35,IF($AD$4=\"C\",0.18*M35,0.18*M35)))","v":0}]
[null,null,null,null,null,null,null,null,null,null,null,null,"maximaal gewenste waarde"]
[null,null,null,null,null,null,null,null,null,null,null,null,"gemeten:"]
[]
[null,null,null,null,null,null,null,null,null,null,null,null,null,null,null,null,null,null,null,null,null,null,null,null,null,null,null,null,null,null,"B"]
[null,null,"VERMENIGVULDIGINGSFACTOR m:",null,null,null,null,null,null,null,null,null,null,{"$f":"+IF(AD4=\"A\",AD56,IF(AD4=\"B\",AE56,IF(AD4=\"C\",AG56,IF(AD4=\"D\",AK56,\"fout\"))))","v":1.5},null,null,null,null,null,null,null,null,null,null,null,null,null,null,null,null,{"$f":"1+0.5*((IF(I9=\"ja\",IF(AJ35=0,0,IF(AJ35=1,MAX(0,MIN(0.2,I37/G35-1.2)),0.2)),0.2)+IF(N43=\"nee\",0.18,IF(N47=\"\",0.18,MIN(N47/G35,0.18)))+0.2+IF(N49=\"nee\",0.025,IF(N53=\"\",0.025,MIN(N53/M35,0.025))))/0.605)","v":1.5}]
[null,null,"De vermenigvuldigingsfactor werd berekend volgens bijlage B.1 van bijlage I bij het EPB-besluit. "]
[]
[null,null,"HULPENERGIE VENTILATOREN",null,null,null,null,null,null,null,null,null,null,null,null,null,null,null,null,"VENTILATORKEUZE"]
[]
[null,null,"type ventilatoren",null,"gelijkstroomventilator (DC)"]
[null,null,null,null,null,"som van toevoer",null,null,null,null,null,null,null,null,null,null,null,null,null,"Specificaties",null,"Gegevens"]
[null,null,"nominaal motorvermogen",null,null,null,"(W)",null,null,null,null,null,null,null,null,null,null,null,null,null,null,"Toevoer"]
[null,null,"maximaal vermogen",null,null,null,"(W)"]
[null,null,"vermogen bij werkingspunt",null,null,null,"(W)",null,null,null,null,null,null,null,null,null,null,null,null,"Benaming"]
[null,null,null,null,null,null,null,null,null,null,null,null,null,null,null,null,null,null,null,"Product-ID"]
[null,null,null,null,null,null,null,null,null,null,null,null,null,null,null,null,null,null,null,"Motortype"]
[null,null,null,null,null,null,null,null,null,null,null,null,null,null,null,null,null,null,null,"Vermogen:"]
[null,null,null,null,null,null,null,null,null,null,null,null,null,null,null,null,null,null,null,"     nominaal motorvermogen"]
[null,null,null,null,null,null,null,null,null,null,null,null,null,null,null,null,null,null,null,"     maximaal vermogen"]
[null,null,null,null,null,null,null,null,null,null,null,null,null,null,null,null,null,null,null,"     vermogen bij werkingspunt (grafiek)"]

{"sheet":"C","index":4,"n_rows":65,"n_cols":40,"rows_kept":65,"cut":false,"hidden":false,"merged":[[63,19,63,20],[64,19,64,20],[55,19,55,20],[58,19,58,20],[59,19,59,20],[60,19,60,20],[61,19,61,20],[62,19,62,20],[9,21,9,25],[54,4,54,5],[3,4,3,8],[10,6,10,9],[10,13,10,15],[9,6,9,15],[10,10,10,12]]}
[]
[null,null,"Berekeningsblad VENTILATIE"]
[null,null,null,null,null,null,null,null,null,null,null,null,null,null,null,null,null,null,null,null,null,null,null,null,null,null,null,null,null,null,null,null,null,null,null,"hulptabel"]
[null,null,"Ventilatiesysteem",null,"C: vrije toevoer, mechanische afvoer",null,null,null,null,null,null,null,null,null,null,null,null,null,null,null,null,null,null,null,null,null,null,null,null,null,null,null,null,null,null,{"$f":"LOOKUP(E4,ventilatiesysteem,Data!B5:B8)","v":"C"},{"$f":"LOOKUP(E4,ventilatiesysteem,Data!C5:C8)","v":3}]
[]
[null,null,"SPECIFICATIEBLAD",null,null,null,null,null,null,null,null,null,null,null,null,null,null,null,null,"PRODUCTKEUZE",null,null,null,null,null,null,null,null,null,null,null,null,null,null,null,{"$f":"+P50","v":1.5}]
[]
[]
[null,null,null,null,null,null,null,null,null,null,null,null,null,null,"debietsmeting?","ja",null,null,null,null,null,null,null,null,null,null,null,null,null,null,null,null,null,null,null,{"$f":"IF(OR(AK4=1,P9=\"nee\"),\"zwart\",\"niet zwart\")","v":"niet zwart"}]
[null,null,null,null,null,null,"Debiet",null,null,null,null,null,null,null,null,null,null,null,null,null,null,"Toevoer",null,null,null,null,"Doorstroom"]
[null,null,null,null,null,null,"Toevoer",null,null,null,"Doorstroom",null,null,"Afvoer",null,null,null,null,null,null,null,null,"dagmaat","LO","q1","ontwerpdebiet"]
[null,null,"Naam","Code","Soort ruimte","Opp","opgelegd minimum","opgelegd maximum","ontwerp","zelfregelendheid","minimum (afvoer)","minimum (toevoer)","ontwerp","opgelegd minimum","ontwerp","gemeten",null,null,null,"Naam","Code",null,"(m)","(m)","(m³/h en /m)","(m³/h)",null,null,null,null,"actief","afvoer","afvoer","toevoer","doorvoer","afvoer","doorvoer","zelfr","zelfr","meting"]
[null,null,null,null,null,"(m²)","(m³/h)","(m³/h)","(m³/h)","()","(m³/h)","(m³/h)","(m³/h)","(m³/h)","(m³/h)","(m³/h)",null,null,null,null,null,null,null,null,null,null,null,null,null,null,null,"actief","actief meting","controle","controle","controle","minimum",null,"actief","0=ts 100 en 120 %,1=>120%,2=<100%"]
[null,null,{"$f":"IF('Algemene gegevens'!C12=\"\",\"\",'Algemene gegevens'!C12)","v":""},{"$f":"IF('Algemene gegevens'!D12=\"\",\"\",'Algemene gegevens'!D12)","v":""},{"$f":"IF('Algemene gegevens'!E12=\"\",\"\",'Algemene gegevens'!E12)","v":""},{"$f":"IF('Algemene gegevens'!F12=\"\",\"\",'Algemene gegevens'!F12)","v":""},{"$f":"IF(E14=\"\",\"\",IF((VLOOKUP(E14,Data!$A$11:$F$31,6,FALSE)=1),IF(E14=\"\",\"\",(IF(VLOOKUP(E14,Data!$A$11:$D$31,2,FALSE)*F14<VLOOKUP(E14,Data!$A$11:$D$31,3,FALSE),ROUND(VLOOKUP(E14,Data!$A$11:$D$31,3,FALSE),0),IF(VLOOKUP(E14,Data!$A$11:$D$31,2,FALSE)*F14>VLOOKUP(E14,Data!$A$11:$D$31,4,FALSE),ROUND(VLOOKUP(E14,Data!$A$11:$D$31,4,FALSE),0),ROUND(VLOOKUP(E14,Data!$A$11:$D$31,2,FALSE)*F14,0))))),\"\"))","v":""},{"$f":"IF(E14=\"\",\"\",IF((VLOOKUP(E14,Data!$A$11:$F$31,6,FALSE)=1),IF((2*(VLOOKUP(E14,Data!$A$11:$D$31,2,FALSE)*F14))<(2*(VLOOKUP(E14,Data!$A$11:$D$31,3,FALSE))),ROUND(2*(VLOOKUP(E14,Data!$A$11:$D$31,3,FALSE)),0),ROUND(2*(VLOOKUP(E14,Data!$A$11:$D$31,2,FALSE))*F14,0)),\"\"))","v":""},null,"P0",{"$f":"IF(F14=\"\",\"\",IF((VLOOKUP(E14,Data!$A$11:$F$31,6,FALSE)=1),ROUND(VLOOKUP($E14,Data!$A$11:$F$31,5,FALSE),0),\"\"))","v":""},{"$f":"IF(F14=\"\",\"\",IF((VLOOKUP(E14,Data!$A$11:$F$31,6,FALSE)=2),ROUND(VLOOKUP($E14,Data!$A$11:$F$31,5,FALSE),0),\"\"))","v":""},null,{"$f":"IF(E14=\"\",\"\",IF((VLOOKUP(E14,Data!$A$11:$F$31,6,FALSE)=2),IF(E14=\"\",\"\",(IF(VLOOKUP(E14,Data!$A$11:$F$31,2,FALSE)*F14<VLOOKUP(E14,Data!$A$11:$F$31,3,FALSE),VLOOKUP(E14,Data!$A$11:$F$31,3,FALSE),IF(VLOOKUP(E14,Data!$A$11:$F$31,2,FALSE)*F14>VLOOKUP(E14,Data!$A$11:$F$31,4,FALSE),VLOOKUP(E14,Data!$A$11:$F$31,4,FALSE),ROUND(VLOOKUP(E14,Data!$A$11:$F$31,2,FALSE)*F14,0))))),\"\"))","v":""},null,62,null,null,null,{"$f":"IF('Algemene gegevens'!C12=\"\",\"\",'Algemene gegevens'!C12)","v":""},{"$f":"IF('Algemene gegevens'!D12=\"\",\"\",'Algemene gegevens'!D12)","v":""},null,null,null,null,{"$f":"(W14-X14)*Y14","v":0},null,null,null,null,{"$f":"IF(F14=\"\",0,1)","v":0},{"$f":"IF(F14=\"\",0,IF(N14=\"\",0,1))","v":0},{"$f":"IF($P$9=\"nee\",0,IF(F14=\"\",0,IF(OR(N14<>\"\",O14<>\"\"),1,0)))","v":0},{"$f":"(IF(H14=\"\",1,IF(AND(I14<=H14,I14>=G14),1,0)))","v":1},{"$f":"(IF(AK14=\"\",1,IF(M14>=AK14,1,0)))","v":1},{"$f":"(IF(N14=\"\",1,IF(O14>=N14,1,0)))","v":1},{"$f":"IF(F14=\"\",\"\",IF((VLOOKUP($E14,Data!$A$11:$F$31,6,FALSE)=1),ROUND(VLOOKUP($E14,Data!$A$11:$F$31,5,FALSE),0),IF((VLOOKUP($E14,Data!$A$11:$F$31,6,FALSE)=2),ROUND(VLOOKUP($E14,Data!$A$11:$F$31,5,FALSE),0),\"\")))","v":""},{"$f":"IF($F14=\"\",\"\",IF(VLOOKUP($E14,Data!$A$11:$F$31,6,FALSE)=1,$AE14*LOOKUP($J14,zelfregelbaarheidsklasse,zelfregelbaarheidsfactor),\"\"))","v":""},{"$f":"IF(F14=\"\",0,IF(OR(G14<>\"\",I14<>\"\"),1,0))","v":0},{"$f":"IF(N14=\"\",-1,IF(E14=\"\",0,IF($P$9=\"ja\",AE14*IF(AND(P14>=N14,P14<=N14*1.2),0,IF(P14>=N14*1.2,1,2)),0)))","v":-1}]
[null,null,{"$f":"IF('Algemene gegevens'!C13=\"\",\"\",'Algemene gegevens'!C13)","v":""},{"$f":"IF('Algemene gegevens'!D13=\"\",\"\",'Algemene gegevens'!D13)","v":""},{"$f":"IF('Algemene gegevens'!E13=\"\",\"\",'Algemene gegevens'!E13)","v":""},{"$f":"IF('Algemene gegevens'!F13=\"\",\"\",'Algemene gegevens'!F13)","v":""},{"$f":"IF(E15=\"\",\"\",IF((VLOOKUP(E15,Data!$A$11:$F$31,6,FALSE)=1),IF(E15=\"\",\"\",(IF(VLOOKUP(E15,Data!$A$11:$D$31,2,FALSE)*F15<VLOOKUP(E15,Data!$A$11:$D$31,3,FALSE),ROUND(VLOOKUP(E15,Data!$A$11:$D$31,3,FALSE),0),IF(VLOOKUP(E15,Data!$A$11:$D$31,2,FALSE)*F15>VLOOKUP(E15,Data!$A$11:$D$31,4,FALSE),ROUND(VLOOKUP(E15,Data!$A$11:$D$31,4,FALSE),0),ROUND(VLOOKUP(E15,Data!$A$11:$D$31,2,FALSE)*F15,0))))),\"\"))","v":""},{"$f":"IF(E15=\"\",\"\",IF((VLOOKUP(E15,Data!$A$11:$F$31,6,FALSE)=1),IF((2*(VLOOKUP(E15,Data!$A$11:$D$31,2,FALSE)*F15))<(2*(VLOOKUP(E15,Data!$A$11:$D$31,3,FALSE))),ROUND(2*(VLOOKUP(E15,Data!$A$11:$D$31,3,FALSE)),0),ROUND(2*(VLOOKUP(E15,Data!$A$11:$D$31,2,FALSE))*F15,0)),\"\"))","v":""},null,"P3",{"$f":"IF(F15=\"\",\"\",IF((VLOOKUP(E15,Data!$A$11:$F$31,6,FALSE)=1),ROUND(VLOOKUP($E15,Data!$A$11:$F$31,5,FALSE),0),\"\"))","v":""},{"$f":"IF(F15=\"\",\"\",IF((VLOOKUP(E15,Data!$A$11:$F$31,6,FALSE)=2),ROUND(VLOOKUP($E15,Data!$A$11:$F$31,5,FALSE),0),\"\"))","v":""},null,{"$f":"IF(E15=\"\",\"\",IF((VLOOKUP(E15,Data!$A$11:$F$31,6,FALSE)=2),IF(E15=\"\",\"\",(IF(VLOOKUP(E15,Data!$A$11:$F$31,2,FALSE)*F15<VLOOKUP(E15,Data!$A$11:$F$31,3,FALSE),VLOOKUP(E15,Data!$A$11:$F$31,3,FALSE),IF(VLOOKUP(E15,Data!$A$11:$F$31,2,FALSE)*F15>VLOOKUP(E15,Data!$A$11:$F$31,4,FALSE),VLOOKUP(E15,Data!$A$11:$F$31,4,FALSE),ROUND(VLOOKUP(E15,Data!$A$11:$F$31,2,FALSE)*F15,0))))),\"\"))","v":""},null,null,null,null,null,{"$f":"IF('Algemene gegevens'!C13=\"\",\"\",'Algemene gegevens'!C13)","v":""},{"$f":"IF('Algemene gegevens'!D13=\"\",\"\",'Algemene gegevens'!D13)","v":""},null,null,null,null,{"$f":"(W15-X15)*Y15","v":0},null,null,null,null,0,{"$f":"IF(F15=\"\",0,IF(N15=\"\",0,1))","v":0},{"$f":"IF($P$9=\"nee\",0,IF(F15=\"\",0,IF(OR(N15<>\"\",O15<>\"\"),1,0)))","v":0},{"$f":"(IF(H15=\"\",1,IF(AND(I15<=H15,I15>=G15),1,0)))","v":1},1,{"$f":"(IF(N15=\"\",1,IF(O15>=N15,1,0)))","v":1},{"$f":"IF(F15=\"\",\"\",IF((VLOOKUP($E15,Data!$A$11:$F$31,6,FALSE)=1),ROUND(VLOOKUP($E15,Data!$A$11:$F$31,5,FALSE),0),IF((VLOOKUP($E15,Data!$A$11:$F$31,6,FALSE)=2),ROUND(VLOOKUP($E15,Data!$A$11:$F$31,5,FALSE),0),\"\")))","v":""},{"$f":"IF($F15=\"\",\"\",IF(VLOOKUP($E15,Data!$A$11:$F$31,6,FALSE)=1,$AE15*LOOKUP($J15,zelfregelbaarheidsklasse,zelfregelbaarheidsfactor),\"\"))","v":""},{"$f":"IF(F15=\"\",0,IF(OR(G15<>\"\",I15<>\"\"),1,0))","v":0},-1]
[null,null,{"$f":"IF('Algemene gegevens'!C14=\"\",\"\",'Algemene gegevens'!C14)","v":""},{"$f":"IF('Algemene gegevens'!D14=\"\",\"\",'Algemene gegevens'!D14)","v":""},{"$f":"IF('Algemene gegevens'!E14=\"\",\"\",'Algemene gegevens'!E14)","v":""},{"$f":"IF('Algemene gegevens'!F14=\"\",\"\",'Algemene gegevens'!F14)","v":""},{"$f":"IF(E16=\"\",\"\",IF((VLOOKUP(E16,Data!$A$11:$F$31,6,FALSE)=1),IF(E16=\"\",\"\",(IF(VLOOKUP(E16,Data!$A$11:$D$31,2,FALSE)*F16<VLOOKUP(E16,Data!$A$11:$D$31,3,FALSE),ROUND(VLOOKUP(E16,Data!$A$11:$D$31,3,FALSE),0),IF(VLOOKUP(E16,Data!$A$11:$D$31,2,FALSE)*F16>VLOOKUP(E16,Data!$A$11:$D$31,4,FALSE),ROUND(VLOOKUP(E16,Data!$A$11:$D$31,4,FALSE),0),ROUND(VLOOKUP(E16,Data!$A$11:$D$31,2,FALSE)*F16,0))))),\"\"))","v":""},{"$f":"IF(E16=\"\",\"\",IF((VLOOKUP(E16,Data!$A$11:$F$31,6,FALSE)=1),IF((2*(VLOOKUP(E16,Data!$A$11:$D$31,2,FALSE)*F16))<(2*(VLOOKUP(E16,Data!$A$11:$D$31,3,FALSE))),ROUND(2*(VLOOKUP(E16,Data!$A$11:$D$31,3,FALSE)),0),ROUND(2*(VLOOKUP(E16,Data!$A$11:$D$31,2,FALSE))*F16,0)),\"\"))","v":""},null,"P4",{"$f":"IF(F16=\"\",\"\",IF((VLOOKUP(E16,Data!$A$11:$F$31,6,FALSE)=1),ROUND(VLOOKUP($E16,Data!$A$11:$F$31,5,FALSE),0),\"\"))","v":""},{"$f":"IF(F16=\"\",\"\",IF((VLOOKUP(E16,Data!$A$11:$F$31,6,FALSE)=2),ROUND(VLOOKUP($E16,Data!$A$11:$F$31,5,FALSE),0),\"\"))","v":""},null,{"$f":"IF(E16=\"\",\"\",IF((VLOOKUP(E16,Data!$A$11:$F$31,6,FALSE)=2),IF(E16=\"\",\"\",(IF(VLOOKUP(E16,Data!$A$11:$F$31,2,FALSE)*F16<VLOOKUP(E16,Data!$A$11:$F$31,3,FALSE),VLOOKUP(E16,Data!$A$11:$F$31,3,FALSE),IF(VLOOKUP(E16,Data!$A$11:$F$31,2,FALSE)*F16>VLOOKUP(E16,Data!$A$11:$F$31,4,FALSE),VLOOKUP(E16,Data!$A$11:$F$31,4,FALSE),ROUND(VLOOKUP(E16,Data!$A$11:$F$31,2,FALSE)*F16,0))))),\"\"))","v":""},null,null,null,null,null,{"$f":"IF('Algemene gegevens'!C14=\"\",\"\",'Algemene gegevens'!C14)","v":""},{"$f":"IF('Algemene gegevens'!D14=\"\",\"\",'Algemene gegevens'!D14)","v":""},null,null,null,null,0,null,null,null,null,0,0,0,1,1,1,{"$f":"IF(F16=\"\",\"\",IF((VLOOKUP($E16,Data!$A$11:$F$31,6,FALSE)=1),ROUND(VLOOKUP($E16,Data!$A$11:$F$31,5,FALSE),0),IF((VLOOKUP($E16,Data!$A$11:$F$31,6,FALSE)=2),ROUND(VLOOKUP($E16,Data!$A$11:$F$31,5,FALSE),0),\"\")))","v":""},{"$f":"IF($F16=\"\",\"\",IF(VLOOKUP($E16,Data!$A$11:$F$31,6,FALSE)=1,$AE16*LOOKUP($J16,zelfregelbaarheidsklasse,zelfregelbaarheidsfactor),\"\"))","v":""},0,-1]
[null,null,{"$f":"IF('Algemene gegevens'!C15=\"\",\"\",'Algemene gegevens'!C15)","v":""},{"$f":"IF('Algemene gegevens'!D15=\"\",\"\",'Algemene gegevens'!D15)","v":""},{"$f":"IF('Algemene gegevens'!E15=\"\",\"\",'Algemene gegevens'!E15)","v":""},{"$f":"IF('Algemene gegevens'!F15=\"\",\"\",'Algemene gegevens'!F15)","v":""},{"$f":"IF(E17=\"\",\"\",IF((VLOOKUP(E17,Data!$A$11:$F$31,6,FALSE)=1),IF(E17=\"\",\"\",(IF(VLOOKUP(E17,Data!$A$11:$D$31,2,FALSE)*F17<VLOOKUP(E17,Data!$A$11:$D$31,3,FALSE),ROUND(VLOOKUP(E17,Data!$A$11:$D$31,3,FALSE),0),IF(VLOOKUP(E17,Data!$A$11:$D$31,2,FALSE)*F17>VLOOKUP(E17,Data!$A$11:$D$31,4,FALSE),ROUND(VLOOKUP(E17,Data!$A$11:$D$31,4,FALSE),0),ROUND(VLOOKUP(E17,Data!$A$11:$D$31,2,FALSE)*F17,0))))),\"\"))","v":""},{"$f":"IF(E17=\"\",\"\",IF((VLOOKUP(E17,Data!$A$11:$F$31,6,FALSE)=1),IF((2*(VLOOKUP(E17,Data!$A$11:$D$31,2,FALSE)*F17))<(2*(VLOOKUP(E17,Data!$A$11:$D$31,3,FALSE))),ROUND(2*(VLOOKUP(E17,Data!$A$11:$D$31,3,FALSE)),0),ROUND(2*(VLOOKUP(E17,Data!$A$11:$D$31,2,FALSE))*F17,0)),\"\"))","v":""},null,"P0",{"$f":"IF(F17=\"\",\"\",IF((VLOOKUP(E17,Data!$A$11:$F$31,6,FALSE)=1),ROUND(VLOOKUP($E17,Data!$A$11:$F$31,5,FALSE),0),\"\"))","v":""},{"$f":"IF(F17=\"\",\"\",IF((VLOOKUP(E17,Data!$A$11:$F$31,6,FALSE)=2),ROUND(VLOOKUP($E17,Data!$A$11:$F$31,5,FALSE),0),\"\"))","v":""},null,{"$f":"IF(E17=\"\",\"\",IF((VLOOKUP(E17,Data!$A$11:$F$31,6,FALSE)=2),IF(E17=\"\",\"\",(IF(VLOOKUP(E17,Data!$A$11:$F$31,2,FALSE)*F17<VLOOKUP(E17,Data!$A$11:$F$31,3,FALSE),VLOOKUP(E17,Data!$A$11:$F$31,3,FALSE),IF(VLOOKUP(E17,Data!$A$11:$F$31,2,FALSE)*F17>VLOOKUP(E17,Data!$A$11:$F$31,4,FALSE),VLOOKUP(E17,Data!$A$11:$F$31,4,FALSE),ROUND(VLOOKUP(E17,Data!$A$11:$F$31,2,FALSE)*F17,0))))),\"\"))","v":""},null,null,null,null,null,{"$f":"IF('Algemene gegevens'!C15=\"\",\"\",'Algemene gegevens'!C15)","v":""},{"$f":"IF('Algemene gegevens'!D15=\"\",\"\",'Algemene gegevens'!D15)","v":""},null,null,null,null,0,null,null,null,null,0,0,0,1,1,1,{"$f":"IF(F17=\"\",\"\",IF((VLOOKUP($E17,Data!$A$11:$F$31,6,FALSE)=1),ROUND(VLOOKUP($E17,Data!$A$11:$F$31,5,FALSE),0),IF((VLOOKUP($E17,Data!$A$11:$F$31,6,FALSE)=2),ROUND(VLOOKUP($E17,Data!$A$11:$F$31,5,FALSE),0),\"\")))","v":""},{"$f":"IF($F17=\"\",\"\",IF(VLOOKUP($E17,Data!$A$11:$F$31,6,FALSE)=1,$AE17*LOOKUP($J17,zelfregelbaarheidsklasse,zelfregelbaarheidsfactor),\"\"))","v":""},0,-1]
[null,null,{"$f":"IF('Algemene gegevens'!C16=\"\",\"\",'Algemene gegevens'!C16)","v":""},{"$f":"IF('Algemene gegevens'!D16=\"\",\"\",'Algemene gegevens'!D16)","v":""},{"$f":"IF('Algemene gegevens'!E16=\"\",\"\",'Algemene gegevens'!E16)","v":""},{"$f":"IF('Algemene gegevens'!F16=\"\",\"\",'Algemene gegevens'!F16)","v":""},{"$f":"IF(E18=\"\",\"\",IF((VLOOKUP(E18,Data!$A$11:$F$31,6,FALSE)=1),IF(E18=\"\",\"\",(IF(VLOOKUP(E18,Data!$A$11:$D$31,2,FALSE)*F18<VLOOKUP(E18,Data!$A$11:$D$31,3,FALSE),ROUND(VLOOKUP(E18,Data!$A$11:$D$31,3,FALSE),0),IF(VLOOKUP(E18,Data!$A$11:$D$31,2,FALSE)*F18>VLOOKUP(E18,Data!$A$11:$D$31,4,FALSE),ROUND(VLOOKUP(E18,Data!$A$11:$D$31,4,FALSE),0),ROUND(VLOOKUP(E18,Data!$A$11:$D$31,2,FALSE)*F18,0))))),\"\"))","v":""},{"$f":"IF(E18=\"\",\"\",IF((VLOOKUP(E18,Data!$A$11:$F$31,6,FALSE)=1),IF((2*(VLOOKUP(E18,Data!$A$11:$D$31,2,FALSE)*F18))<(2*(VLOOKUP(E18,Data!$A$11:$D$31,3,FALSE))),ROUND(2*(VLOOKUP(E18,Data!$A$11:$D$31,3,FALSE)),0),ROUND(2*(VLOOKUP(E18,Data!$A$11:$D$31,2,FALSE))*F18,0)),\"\"))","v":""},null,"P0",{"$f":"IF(F18=\"\",\"\",IF((VLOOKUP(E18,Data!$A$11:$F$31,6,FALSE)=1),ROUND(VLOOKUP($E18,Data!$A$11:$F$31,5,FALSE),0),\"\"))","v":""},{"$f":"IF(F18=\"\",\"\",IF((VLOOKUP(E18,Data!$A$11:$F$31,6,FALSE)=2),ROUND(VLOOKUP($E18,Data!$A$11:$F$31,5,FALSE),0),\"\"))","v":""},null,{"$f":"IF(E18=\"\",\"\",IF((VLOOKUP(E18,Data!$A$11:$F$31,6,FALSE)=2),IF(E18=\"\",\"\",(IF(VLOOKUP(E18,Data!$A$11:$F$31,2,FALSE)*F18<VLOOKUP(E18,Data!$A$11:$F$31,3,FALSE),VLOOKUP(E18,Data!$A$11:$F$31,3,FALSE),IF(VLOOKUP(E18,Data!$A$11:$F$31,2,FALSE)*F18>VLOOKUP(E18,Data!$A$11:$F$31,4,FALSE),VLOOKUP(E18,Data!$A$11:$F$31,4,FALSE),ROUND(VLOOKUP(E18,Data!$A$11:$F$31,2,FALSE)*F18,0))))),\"\"))","v":""},null,27,null,null,null,{"$f":"IF('Algemene gegevens'!C16=\"\",\"\",'Algemene gegevens'!C16)","v":""},{"$f":"IF('Algemene gegevens'!D16=\"\",\"\",'Algemene gegevens'!D16)","v":""},null,null,null,null,0,null,null,null,null,0,0,0,1,1,1,{"$f":"IF(F18=\"\",\"\",IF((VLOOKUP($E18,Data!$A$11:$F$31,6,FALSE)=1),ROUND(VLOOKUP($E18,Data!$A$11:$F$31,5,FALSE),0),IF((VLOOKUP($E18,Data!$A$11:$F$31,6,FALSE)=2),ROUND(VLOOKUP($E18,Data!$A$11:$F$31,5,FALSE),0),\"\")))","v":""},{"$f":"IF($F18=\"\",\"\",IF(VLOOKUP($E18,Data!$A$11:$F$31,6,FALSE)=1,$AE18*LOOKUP($J18,zelfregelbaarheidsklasse,zelfregelbaarheidsfactor),\"\"))","v":""},0,-1]
[null,null,{"$f":"IF('Algemene gegevens'!C17=\"\",\"\",'Algemene gegevens'!C17)","v":""},{"$f":"IF('Algemene gegevens'!D17=\"\",\"\",'Algemene gegevens'!D17)","v":""},{"$f":"IF('Algemene gegevens'!E17=\"\",\"\",'Algemene gegevens'!E17)","v":""},{"$f":"IF('Algemene gegevens'!F17=\"\",\"\",'Algemene gegevens'!F17)","v":""},{"$f":"IF(E19=\"\",\"\",IF((VLOOKUP(E19,Data!$A$11:$F$31,6,FALSE)=1),IF(E19=\"\",\"\",(IF(VLOOKUP(E19,Data!$A$11:$D$31,2,FALSE)*F19<VLOOKUP(E19,Data!$A$11:$D$31,3,FALSE),ROUND(VLOOKUP(E19,Data!$A$11:$D$31,3,FALSE),0),IF(VLOOKUP(E19,Data!$A$11:$D$31,2,FALSE)*F19>VLOOKUP(E19,Data!$A$11:$D$31,4,FALSE),ROUND(VLOOKUP(E19,Data!$A$11:$D$31,4,FALSE),0),ROUND(VLOOKUP(E19,Data!$A$11:$D$31,2,FALSE)*F19,0))))),\"\"))","v":""},{"$f":"IF(E19=\"\",\"\",IF((VLOOKUP(E19,Data!$A$11:$F$31,6,FALSE)=1),IF((2*(VLOOKUP(E19,Data!$A$11:$D$31,2,FALSE)*F19))<(2*(VLOOKUP(E19,Data!$A$11:$D$31,3,FALSE))),ROUND(2*(VLOOKUP(E19,Data!$A$11:$D$31,3,FALSE)),0),ROUND(2*(VLOOKUP(E19,Data!$A$11:$D$31,2,FALSE))*F19,0)),\"\"))","v":""},null,"P0",{"$f":"IF(F19=\"\",\"\",IF((VLOOKUP(E19,Data!$A$11:$F$31,6,FALSE)=1),ROUND(VLOOKUP($E19,Data!$A$11:$F$31,5,FALSE),0),\"\"))","v":""},{"$f":"IF(F19=\"\",\"\",IF((VLOOKUP(E19,Data!$A$11:$F$31,6,FALSE)=2),ROUND(VLOOKUP($E19,Data!$A$11:$F$31,5,FALSE),0),\"\"))","v":""},null,{"$f":"IF(E19=\"\",\"\",IF((VLOOKUP(E19,Data!$A$11:$F$31,6,FALSE)=2),IF(E19=\"\",\"\",(IF(VLOOKUP(E19,Data!$A$11:$F$31,2,FALSE)*F19<VLOOKUP(E19,Data!$A$11:$F$31,3,FALSE),VLOOKUP(E19,Data!$A$11:$F$31,3,FALSE),IF(VLOOKUP(E19,Data!$A$11:$F$31,2,FALSE)*F19>VLOOKUP(E19,Data!$A$11:$F$31,4,FALSE),VLOOKUP(E19,Data!$A$11:$F$31,4,FALSE),ROUND(VLOOKUP(E19,Data!$A$11:$F$31,2,FALSE)*F19,0))))),\"\"))","v":""},null,56,null,null,null,{"$f":"IF('Algemene gegevens'!C17=\"\",\"\",'Algemene gegevens'!C17)","v":""},{"$f":"IF('Algemene gegevens'!D17=\"\",\"\",'Algemene gegevens'!D17)","v":""},null,null,null,null,0,null,null,null,null,0,0,0,1,1,1,{"$f":"IF(F19=\"\",\"\",IF((VLOOKUP($E19,Data!$A$11:$F$31,6,FALSE)=1),ROUND(VLOOKUP($E19,Data!$A$11:$F$31,5,FALSE),0),IF((VLOOKUP($E19,Data!$A$11:$F$31,6,FALSE)=2),ROUND(VLOOKUP($E19,Data!$A$11:$F$31,5,FALSE),0),\"\")))","v":""},{"$f":"IF($F19=\"\",\"\",IF(VLOOKUP($E19,Data!$A$11:$F$31,6,FALSE)=1,$AE19*LOOKUP($J19,zelfregelbaarheidsklasse,zelfregelbaarheidsfactor),\"\"))","v":""},0,-1]
[null,null,{"$f":"IF('Algemene gegevens'!C18=\"\",\"\",'Algemene gegevens'!C18)","v":""},{"$f":"IF('Algemene gegevens'!D18=\"\",\"\",'Algemene gegevens'!D18)","v":""},{"$f":"IF('Algemene gegevens'!E18=\"\",\"\",'Algemene gegevens'!E18)","v":""},{"$f":"IF('Algemene gegevens'!F18=\"\",\"\",'Algemene gegevens'!F18)","v":""},{"$f":"IF(E20=\"\",\"\",IF((VLOOKUP(E20,Data!$A$11:$F$31,6,FALSE)=1),IF(E20=\"\",\"\",(IF(VLOOKUP(E20,Data!$A$11:$D$31,2,FALSE)*F20<VLOOKUP(E20,Data!$A$11:$D$31,3,FALSE),ROUND(VLOOKUP(E20,Data!$A$11:$D$31,3,FALSE),0),IF(VLOOKUP(E20,Data!$A$11:$D$31,2,FALSE)*F20>VLOOKUP(E20,Data!$A$11:$D$31,4,FALSE),ROUND(VLOOKUP(E20,Data!$A$11:$D$31,4,FALSE),0),ROUND(VLOOKUP(E20,Data!$A$11:$D$31,2,FALSE)*F20,0))))),\"\"))","v":""},{"$f":"IF(E20=\"\",\"\",IF((VLOOKUP(E20,Data!$A$11:$F$31,6,FALSE)=1),IF((2*(VLOOKUP(E20,Data!$A$11:$D$31,2,FALSE)*F20))<(2*(VLOOKUP(E20,Data!$A$11:$D$31,3,FALSE))),ROUND(2*(VLOOKUP(E20,Data!$A$11:$D$31,3,FALSE)),0),ROUND(2*(VLOOKUP(E20,Data!$A$11:$D$31,2,FALSE))*F20,0)),\"\"))","v":""},null,"P3",{"$f":"IF(F20=\"\",\"\",IF((VLOOKUP(E20,Data!$A$11:$F$31,6,FALSE)=1),ROUND(VLOOKUP($E20,Data!$A$11:$F$31,5,FALSE),0),\"\"))","v":""},{"$f":"IF(F20=\"\",\"\",IF((VLOOKUP(E20,Data!$A$11:$F$31,6,FALSE)=2),ROUND(VLOOKUP($E20,Data!$A$11:$F$31,5,FALSE),0),\"\"))","v":""},null,{"$f":"IF(E20=\"\",\"\",IF((VLOOKUP(E20,Data!$A$11:$F$31,6,FALSE)=2),IF(E20=\"\",\"\",(IF(VLOOKUP(E20,Data!$A$11:$F$31,2,FALSE)*F20<VLOOKUP(E20,Data!$A$11:$F$31,3,FALSE),VLOOKUP(E20,Data!$A$11:$F$31,3,FALSE),IF(VLOOKUP(E20,Data!$A$11:$F$31,2,FALSE)*F20>VLOOKUP(E20,Data!$A$11:$F$31,4,FALSE),VLOOKUP(E20,Data!$A$11:$F$31,4,FALSE),ROUND(VLOOKUP(E20,Data!$A$11:$F$31,2,FALSE)*F20,0))))),\"\"))","v":""},null,null,null,null,null,{"$f":"IF('Algemene gegevens'!C18=\"\",\"\",'Algemene gegevens'!C18)","v":""},{"$f":"IF('Algemene gegevens'!D18=\"\",\"\",'Algemene gegevens'!D18)","v":""},null,null,null,null,0,null,null,null,null,0,0,0,1,1,1,{"$f":"IF(F20=\"\",\"\",IF((VLOOKUP($E20,Data!$A$11:$F$31,6,FALSE)=1),ROUND(VLOOKUP($E20,Data!$A$11:$F$31,5,FALSE),0),IF((VLOOKUP($E20,Data!$A$11:$F$31,6,FALSE)=2),ROUND(VLOOKUP($E20,Data!$A$11:$F$31,5,FALSE),0),\"\")))","v":""},{"$f":"IF($F20=\"\",\"\",IF(VLOOKUP($E20,Data!$A$11:$F$31,6,FALSE)=1,$AE20*LOOKUP($J20,zelfregelbaarheidsklasse,zelfregelbaarheidsfactor),\"\"))","v":""},0,-1]
[null,null,{"$f":"IF('Algemene gegevens'!C19=\"\",\"\",'Algemene gegevens'!C19)","v":""},{"$f":"IF('Algemene gegevens'!D19=\"\",\"\",'Algemene gegevens'!D19)","v":""},{"$f":"IF('Algemene gegevens'!E19=\"\",\"\",'Algemene gegevens'!E19)","v":""},{"$f":"IF('Algemene gegevens'!F19=\"\",\"\",'Algemene gegevens'!F19)","v":""},{"$f":"IF(E21=\"\",\"\",IF((VLOOKUP(E21,Data!$A$11:$F$31,6,FALSE)=1),IF(E21=\"\",\"\",(IF(VLOOKUP(E21,Data!$A$11:$D$31,2,FALSE)*F21<VLOOKUP(E21,Data!$A$11:$D$31,3,FALSE),ROUND(VLOOKUP(E21,Data!$A$11:$D$31,3,FALSE),0),IF(VLOOKUP(E21,Data!$A$11:$D$31,2,FALSE)*F21>VLOOKUP(E21,Data!$A$11:$D$31,4,FALSE),ROUND(VLOOKUP(E21,Data!$A$11:$D$31,4,FALSE),0),ROUND(VLOOKUP(E21,Data!$A$11:$D$31,2,FALSE)*F21,0))))),\"\"))","v":""},{"$f":"IF(E21=\"\",\"\",IF((VLOOKUP(E21,Data!$A$11:$F$31,6,FALSE)=1),IF((2*(VLOOKUP(E21,Data!$A$11:$D$31,2,FALSE)*F21))<(2*(VLOOKUP(E21,Data!$A$11:$D$31,3,FALSE))),ROUND(2*(VLOOKUP(E21,Data!$A$11:$D$31,3,FALSE)),0),ROUND(2*(VLOOKUP(E21,Data!$A$11:$D$31,2,FALSE))*F21,0)),\"\"))","v":""},null,"P0",{"$f":"IF(F21=\"\",\"\",IF((VLOOKUP(E21,Data!$A$11:$F$31,6,FALSE)=1),ROUND(VLOOKUP($E21,Data!$A$11:$F$31,5,FALSE),0),\"\"))","v":""},{"$f":"IF(F21=\"\",\"\",IF((VLOOKUP(E21,Data!$A$11:$F$31,6,FALSE)=2),ROUND(VLOOKUP($E21,Data!$A$11:$F$31,5,FALSE),0),\"\"))","v":""},null,{"$f":"IF(E21=\"\",\"\",IF((VLOOKUP(E21,Data!$A$11:$F$31,6,FALSE)=2),IF(E21=\"\",\"\",(IF(VLOOKUP(E21,Data!$A$11:$F$31,2,FALSE)*F21<VLOOKUP(E21,Data!$A$11:$F$31,3,FALSE),VLOOKUP(E21,Data!$A$11:$F$31,3,FALSE),IF(VLOOKUP(E21,Data!$A$11:$F$31,2,FALSE)*F21>VLOOKUP(E21,Data!$A$11:$F$31,4,FALSE),VLOOKUP(E21,Data!$A$11:$F$31,4,FALSE),ROUND(VLOOKUP(E21,Data!$A$11:$F$31,2,FALSE)*F21,0))))),\"\"))","v":""},null,null,null,null,null,{"$f":"IF('Algemene gegevens'!C19=\"\",\"\",'Algemene gegevens'!C19)","v":""},{"$f":"IF('Algemene gegevens'!D19=\"\",\"\",'Algemene gegevens'!D19)","v":""},null,null,null,null,0,null,null,null,null,0,0,0,1,1,1,{"$f":"IF(F21=\"\",\"\",IF((VLOOKUP($E21,Data!$A$11:$F$31,6,FALSE)=1),ROUND(VLOOKUP($E21,Data!$A$11:$F$31,5,FALSE),0),IF((VLOOKUP($E21,Data!$A$11:$F$31,6,FALSE)=2),ROUND(VLOOKUP($E21,Data!$A$11:$F$31,5,FALSE),0),\"\")))","v":""},{"$f":"IF($F21=\"\",\"\",IF(VLOOKUP($E21,Data!$A$11:$F$31,6,FALSE)=1,$AE21*LOOKUP($J21,zelfregelbaarheidsklasse,zelfregelbaarheidsfactor),\"\"))","v":""},0,-1]
[null,null,{"$f":"IF('Algemene gegevens'!C20=\"\",\"\",'Algemene gegevens'!C20)","v":""},{"$f":"IF('Algemene gegevens'!D20=\"\",\"\",'Algemene gegevens'!D20)","v":""},{"$f":"IF('Algemene gegevens'!E20=\"\",\"\",'Algemene gegevens'!E20)","v":""},{"$f":"IF('Algemene gegevens'!F20=\"\",\"\",'Algemene gegevens'!F20)","v":""},{"$f":"IF(E22=\"\",\"\",IF((VLOOKUP(E22,Data!$A$11:$F$31,6,FALSE)=1),IF(E22=\"\",\"\",(IF(VLOOKUP(E22,Data!$A$11:$D$31,2,FALSE)*F22<VLOOKUP(E22,Data!$A$11:$D$31,3,FALSE),ROUND(VLOOKUP(E22,Data!$A$11:$D$31,3,FALSE),0),IF(VLOOKUP(E22,Data!$A$11:$D$31,2,FALSE)*F22>VLOOKUP(E22,Data!$A$11:$D$31,4,FALSE),ROUND(VLOOKUP(E22,Data!$A$11:$D$31,4,FALSE),0),ROUND(VLOOKUP(E22,Data!$A$11:$D$31,2,FALSE)*F22,0))))),\"\"))","v":""},{"$f":"IF(E22=\"\",\"\",IF((VLOOKUP(E22,Data!$A$11:$F$31,6,FALSE)=1),IF((2*(VLOOKUP(E22,Data!$A$11:$D$31,2,FALSE)*F22))<(2*(VLOOKUP(E22,Data!$A$11:$D$31,3,FALSE))),ROUND(2*(VLOOKUP(E22,Data!$A$11:$D$31,3,FALSE)),0),ROUND(2*(VLOOKUP(E22,Data!$A$11:$D$31,2,FALSE))*F22,0)),\"\"))","v":""},null,"P3",{"$f":"IF(F22=\"\",\"\",IF((VLOOKUP(E22,Data!$A$11:$F$31,6,FALSE)=1),ROUND(VLOOKUP($E22,Data!$A$11:$F$31,5,FALSE),0),\"\"))","v":""},{"$f":"IF(F22=\"\",\"\",IF((VLOOKUP(E22,Data!$A$11:$F$31,6,FALSE)=2),ROUND(VLOOKUP($E22,Data!$A$11:$F$31,5,FALSE),0),\"\"))","v":""},null,{"$f":"IF(E22=\"\",\"\",IF((VLOOKUP(E22,Data!$A$11:$F$31,6,FALSE)=2),IF(E22=\"\",\"\",(IF(VLOOKUP(E22,Data!$A$11:$F$31,2,FALSE)*F22<VLOOKUP(E22,Data!$A$11:$F$31,3,FALSE),VLOOKUP(E22,Data!$A$11:$F$31,3,FALSE),IF(VLOOKUP(E22,Data!$A$11:$F$31,2,FALSE)*F22>VLOOKUP(E22,Data!$A$11:$F$31,4,FALSE),VLOOKUP(E22,Data!$A$11:$F$31,4,FALSE),ROUND(VLOOKUP(E22,Data!$A$11:$F$31,2,FALSE)*F22,0))))),\"\"))","v":""},null,null,null,null,null,{"$f":"IF('Algemene gegevens'!C20=\"\",\"\",'Algemene gegevens'!C20)","v":""},{"$f":"IF('Algemene gegevens'!D20=\"\",\"\",'Algemene gegevens'!D20)","v":""},null,null,null,null,0,null,null,null,null,0,0,0,1,1,1,{"$f":"IF(F22=\"\",\"\",IF((VLOOKUP($E22,Data!$A$11:$F$31,6,FALSE)=1),ROUND(VLOOKUP($E22,Data!$A$11:$F$31,5,FALSE),0),IF((VLOOKUP($E22,Data!$A$11:$F$31,6,FALSE)=2),ROUND(VLOOKUP($E22,Data!$A$11:$F$31,5,FALSE),0),\"\")))","v":""},{"$f":"IF($F22=\"\",\"\",IF(VLOOKUP($E22,Data!$A$11:$F$31,6,FALSE)=1,$AE22*LOOKUP($J22,zelfregelbaarheidsklasse,zelfregelbaarheidsfactor),\"\"))","v":""},0,-1]
[null,null,{"$f":"IF('Algemene gegevens'!C21=\"\",\"\",'Algemene gegevens'!C21)","v":""},{"$f":"IF('Algemene gegevens'!D21=\"\",\"\",'Algemene gegevens'!D21)","v":""},{"$f":"IF('Algemene gegevens'!E21=\"\",\"\",'Algemene gegevens'!E21)","v":""},{"$f":"IF('Algemene gegevens'!F21=\"\",\"\",'Algemene gegevens'!F21)","v":""},{"$f":"IF(E23=\"\",\"\",IF((VLOOKUP(E23,Data!$A$11:$F$31,6,FALSE)=1),IF(E23=\"\",\"\",(IF(VLOOKUP(E23,Data!$A$11:$D$31,2,FALSE)*F23<VLOOKUP(E23,Data!$A$11:$D$31,3,FALSE),ROUND(VLOOKUP(E23,Data!$A$11:$D$31,3,FALSE),0),IF(VLOOKUP(E23,Data!$A$11:$D$31,2,FALSE)*F23>VLOOKUP(E23,Data!$A$11:$D$31,4,FALSE),ROUND(VLOOKUP(E23,Data!$A$11:$D$31,4,FALSE),0),ROUND(VLOOKUP(E23,Data!$A$11:$D$31,2,FALSE)*F23,0))))),\"\"))","v":""},{"$f":"IF(E23=\"\",\"\",IF((VLOOKUP(E23,Data!$A$11:$F$31,6,FALSE)=1),IF((2*(VLOOKUP(E23,Data!$A$11:$D$31,2,FALSE)*F23))<(2*(VLOOKUP(E23,Data!$A$11:$D$31,3,FALSE))),ROUND(2*(VLOOKUP(E23,Data!$A$11:$D$31,3,FALSE)),0),ROUND(2*(VLOOKUP(E23,Data!$A$11:$D$31,2,FALSE))*F23,0)),\"\"))","v":""},null,"P3",{"$f":"IF(F23=\"\",\"\",IF((VLOOKUP(E23,Data!$A$11:$F$31,6,FALSE)=1),ROUND(VLOOKUP($E23,Data!$A$11:$F$31,5,FALSE),0),\"\"))","v":""},{"$f":"IF(F23=\"\",\"\",IF((VLOOKUP(E23,Data!$A$11:$F$31,6,FALSE)=2),ROUND(VLOOKUP($E23,Data!$A$11:$F$31,5,FALSE),0),\"\"))","v":""},null,{"$f":"IF(E23=\"\",\"\",IF((VLOOKUP(E23,Data!$A$11:$F$31,6,FALSE)=2),IF(E23=\"\",\"\",(IF(VLOOKUP(E23,Data!$A$11:$F$31,2,FALSE)*F23<VLOOKUP(E23,Data!$A$11:$F$31,3,FALSE),VLOOKUP(E23,Data!$A$11:$F$31,3,FALSE),IF(VLOOKUP(E23,Data!$A$11:$F$31,2,FALSE)*F23>VLOOKUP(E23,Data!$A$11:$F$31,4,FALSE),VLOOKUP(E23,Data!$A$11:$F$31,4,FALSE),ROUND(VLOOKUP(E23,Data!$A$11:$F$31,2,FALSE)*F23,0))))),\"\"))","v":""},null,null,null,null,null,{"$f":"IF('Algemene gegevens'!C21=\"\",\"\",'Algemene gegevens'!C21)","v":""},{"$f":"IF('Algemene gegevens'!D21=\"\",\"\",'Algemene gegevens'!D21)","v":""},null,null,null,null,0,null,null,null,null,0,0,0,1,1,1,{"$f":"IF(F23=\"\",\"\",IF((VLOOKUP($E23,Data!$A$11:$F$31,6,FALSE)=1),ROUND(VLOOKUP($E23,Data!$A$11:$F$31,5,FALSE),0),IF((VLOOKUP($E23,Data!$A$11:$F$31,6,FALSE)=2),ROUND(VLOOKUP($E23,Data!$A$11:$F$31,5,FALSE),0),\"\")))","v":""},{"$f":"IF($F23=\"\",\"\",IF(VLOOKUP($E23,Data!$A$11:$F$31,6,FALSE)=1,$AE23*LOOKUP($J23,zelfregelbaarheidsklasse,zelfregelbaarheidsfactor),\"\"))","v":""},0,-1]
[null,null,{"$f":"IF('Algemene gegevens'!C22=\"\",\"\",'Algemene gegevens'!C22)","v":""},{"$f":"IF('Algemene gegevens'!D22=\"\",\"\",'Algemene gegevens'!D22)","v":""},{"$f":"IF('Algemene gegevens'!E22=\"\",\"\",'Algemene gegevens'!E22)","v":""},{"$f":"IF('Algemene gegevens'!F22=\"\",\"\",'Algemene gegevens'!F22)","v":""},{"$f":"IF(E24=\"\",\"\",IF((VLOOKUP(E24,Data!$A$11:$F$31,6,FALSE)=1),IF(E24=\"\",\"\",(IF(VLOOKUP(E24,Data!$A$11:$D$31,2,FALSE)*F24<VLOOKUP(E24,Data!$A$11:$D$31,3,FALSE),ROUND(VLOOKUP(E24,Data!$A$11:$D$31,3,FALSE),0),IF(VLOOKUP(E24,Data!$A$11:$D$31,2,FALSE)*F24>VLOOKUP(E24,Data!$A$11:$D$31,4,FALSE),ROUND(VLOOKUP(E24,Data!$A$11:$D$31,4,FALSE),0),ROUND(VLOOKUP(E24,Data!$A$11:$D$31,2,FALSE)*F24,0))))),\"\"))","v":""},{"$f":"IF(E24=\"\",\"\",IF((VLOOKUP(E24,Data!$A$11:$F$31,6,FALSE)=1),IF((2*(VLOOKUP(E24,Data!$A$11:$D$31,2,FALSE)*F24))<(2*(VLOOKUP(E24,Data!$A$11:$D$31,3,FALSE))),ROUND(2*(VLOOKUP(E24,Data!$A$11:$D$31,3,FALSE)),0),ROUND(2*(VLOOKUP(E24,Data!$A$11:$D$31,2,FALSE))*F24,0)),\"\"))","v":""},null,"P0",{"$f":"IF(F24=\"\",\"\",IF((VLOOKUP(E24,Data!$A$11:$F$31,6,FALSE)=1),ROUND(VLOOKUP($E24,Data!$A$11:$F$31,5,FALSE),0),\"\"))","v":""},{"$f":"IF(F24=\"\",\"\",IF((VLOOKUP(E24,Data!$A$11:$F$31,6,FALSE)=2),ROUND(VLOOKUP($E24,Data!$A$11:$F$31,5,FALSE),0),\"\"))","v":""},null,{"$f":"IF(E24=\"\",\"\",IF((VLOOKUP(E24,Data!$A$11:$F$31,6,FALSE)=2),IF(E24=\"\",\"\",(IF(VLOOKUP(E24,Data!$A$11:$F$31,2,FALSE)*F24<VLOOKUP(E24,Data!$A$11:$F$31,3,FALSE),VLOOKUP(E24,Data!$A$11:$F$31,3,FALSE),IF(VLOOKUP(E24,Data!$A$11:$F$31,2,FALSE)*F24>VLOOKUP(E24,Data!$A$11:$F$31,4,FALSE),VLOOKUP(E24,Data!$A$11:$F$31,4,FALSE),ROUND(VLOOKUP(E24,Data!$A$11:$F$31,2,FALSE)*F24,0))))),\"\"))","v":""},null,null,null,null,null,{"$f":"IF('Algemene gegevens'!C22=\"\",\"\",'Algemene gegevens'!C22)","v":""},{"$f":"IF('Algemene gegevens'!D22=\"\",\"\",'Algemene gegevens'!D22)","v":""},null,null,null,null,0,null,null,null,null,0,0,0,1,1,1,{"$f":"IF(F24=\"\",\"\",IF((VLOOKUP($E24,Data!$A$11:$F$31,6,FALSE)=1),ROUND(VLOOKUP($E24,Data!$A$11:$F$31,5,FALSE),0),IF((VLOOKUP($E24,Data!$A$11:$F$31,6,FALSE)=2),ROUND(VLOOKUP($E24,Data!$A$11:$F$31,5,FALSE),0),\"\")))","v":""},{"$f":"IF($F24=\"\",\"\",IF(VLOOKUP($E24,Data!$A$11:$F$31,6,FALSE)=1,$AE24*LOOKUP($J24,zelfregelbaarheidsklasse,zelfregelbaarheidsfactor),\"\"))","v":""},0,-1]
[null,null,{"$f":"IF('Algemene gegevens'!C23=\"\",\"\",'Algemene gegevens'!C23)","v":""},{"$f":"IF('Algemene gegevens'!D23=\"\",\"\",'Algemene gegevens'!D23)","v":""},{"$f":"IF('Algemene gegevens'!E23=\"\",\"\",'Algemene gegevens'!E23)","v":""},{"$f":"IF('Algemene gegevens'!F23=\"\",\"\",'Algemene gegevens'!F23)","v":""},{"$f":"IF(E25=\"\",\"\",IF((VLOOKUP(E25,Data!$A$11:$F$31,6,FALSE)=1),IF(E25=\"\",\"\",(IF(VLOOKUP(E25,Data!$A$11:$D$31,2,FALSE)*F25<VLOOKUP(E25,Data!$A$11:$D$31,3,FALSE),ROUND(VLOOKUP(E25,Data!$A$11:$D$31,3,FALSE),0),IF(VLOOKUP(E25,Data!$A$11:$D$31,2,FALSE)*F25>VLOOKUP(E25,Data!$A$11:$D$31,4,FALSE),ROUND(VLOOKUP(E25,Data!$A$11:$D$31,4,FALSE),0),ROUND(VLOOKUP(E25,Data!$A$11:$D$31,2,FALSE)*F25,0))))),\"\"))","v":""},{"$f":"IF(E25=\"\",\"\",IF((VLOOKUP(E25,Data!$A$11:$F$31,6,FALSE)=1),IF((2*(VLOOKUP(E25,Data!$A$11:$D$31,2,FALSE)*F25))<(2*(VLOOKUP(E25,Data!$A$11:$D$31,3,FALSE))),ROUND(2*(VLOOKUP(E25,Data!$A$11:$D$31,3,FALSE)),0),ROUND(2*(VLOOKUP(E25,Data!$A$11:$D$31,2,FALSE))*F25,0)),\"\"))","v":""},null,"P0",{"$f":"IF(F25=\"\",\"\",IF((VLOOKUP(E25,Data!$A$11:$F$31,6,FALSE)=1),ROUND(VLOOKUP($E25,Data!$A$11:$F$31,5,FALSE),0),\"\"))","v":""},{"$f":"IF(F25=\"\",\"\",IF((VLOOKUP(E25,Data!$A$11:$F$31,6,FALSE)=2),ROUND(VLOOKUP($E25,Data!$A$11:$F$31,5,FALSE),0),\"\"))","v":""},null,{"$f":"IF(E25=\"\",\"\",IF((VLOOKUP(E25,Data!$A$11:$F$31,6,FALSE)=2),IF(E25=\"\",\"\",(IF(VLOOKUP(E25,Data!$A$11:$F$31,2,FALSE)*F25<VLOOKUP(E25,Data!$A$11:$F$31,3,FALSE),VLOOKUP(E25,Data!$A$11:$F$31,3,FALSE),IF(VLOOKUP(E25,Data!$A$11:$F$31,2,FALSE)*F25>VLOOKUP(E25,Data!$A$11:$F$31,4,FALSE),VLOOKUP(E25,Data!$A$11:$F$31,4,FALSE),ROUND(VLOOKUP(E25,Data!$A$11:$F$31,2,FALSE)*F25,0))))),\"\"))","v":""},null,60,null,null,null,{"$f":"IF('Algemene gegevens'!C23=\"\",\"\",'Algemene gegevens'!C23)","v":""},{"$f":"IF('Algemene gegevens'!D23=\"\",\"\",'Algemene gegevens'!D23)","v":""},null,null,null,null,0,null,null,null,null,0,0,0,1,1,1,{"$f":"IF(F25=\"\",\"\",IF((VLOOKUP($E25,Data!$A$11:$F$31,6,FALSE)=1),ROUND(VLOOKUP($E25,Data!$A$11:$F$31,5,FALSE),0),IF((VLOOKUP($E25,Data!$A$11:$F$31,6,FALSE)=2),ROUND(VLOOKUP($E25,Data!$A$11:$F$31,5,FALSE),0),\"\")))","v":""},{"$f":"IF($F25=\"\",\"\",IF(VLOOKUP($E25,Data!$A$11:$F$31,6,FALSE)=1,$AE25*LOOKUP($J25,zelfregelbaarheidsklasse,zelfregelbaarheidsfactor),\"\"))","v":""},0,-1]
[null,null,{"$f":"IF('Algemene gegevens'!C24=\"\",\"\",'Algemene gegevens'!C24)","v":""},{"$f":"IF('Algemene gegevens'!D24=\"\",\"\",'Algemene gegevens'!D24)","v":""},{"$f":"IF('Algemene gegevens'!E24=\"\",\"\",'Algemene gegevens'!E24)","v":""},{"$f":"IF('Algemene gegevens'!F24=\"\",\"\",'Algemene gegevens'!F24)","v":""},{"$f":"IF(E26=\"\",\"\",IF((VLOOKUP(E26,Data!$A$11:$F$31,6,FALSE)=1),IF(E26=\"\",\"\",(IF(VLOOKUP(E26,Data!$A$11:$D$31,2,FALSE)*F26<VLOOKUP(E26,Data!$A$11:$D$31,3,FALSE),ROUND(VLOOKUP(E26,Data!$A$11:$D$31,3,FALSE),0),IF(VLOOKUP(E26,Data!$A$11:$D$31,2,FALSE)*F26>VLOOKUP(E26,Data!$A$11:$D$31,4,FALSE),ROUND(VLOOKUP(E26,Data!$A$11:$D$31,4,FALSE),0),ROUND(VLOOKUP(E26,Data!$A$11:$D$31,2,FALSE)*F26,0))))),\"\"))","v":""},{"$f":"IF(E26=\"\",\"\",IF((VLOOKUP(E26,Data!$A$11:$F$31,6,FALSE)=1),IF((2*(VLOOKUP(E26,Data!$A$11:$D$31,2,FALSE)*F26))<(2*(VLOOKUP(E26,Data!$A$11:$D$31,3,FALSE))),ROUND(2*(VLOOKUP(E26,Data!$A$11:$D$31,3,FALSE)),0),ROUND(2*(VLOOKUP(E26,Data!$A$11:$D$31,2,FALSE))*F26,0)),\"\"))","v":""},null,"P0",{"$f":"IF(F26=\"\",\"\",IF((VLOOKUP(E26,Data!$A$11:$F$31,6,FALSE)=1),ROUND(VLOOKUP($E26,Data!$A$11:$F$31,5,FALSE),0),\"\"))","v":""},{"$f":"IF(F26=\"\",\"\",IF((VLOOKUP(E26,Data!$A$11:$F$31,6,FALSE)=2),ROUND(VLOOKUP($E26,Data!$A$11:$F$31,5,FALSE),0),\"\"))","v":""},null,{"$f":"IF(E26=\"\",\"\",IF((VLOOKUP(E26,Data!$A$11:$F$31,6,FALSE)=2),IF(E26=\"\",\"\",(IF(VLOOKUP(E26,Data!$A$11:$F$31,2,FALSE)*F26<VLOOKUP(E26,Data!$A$11:$F$31,3,FALSE),VLOOKUP(E26,Data!$A$11:$F$31,3,FALSE),IF(VLOOKUP(E26,Data!$A$11:$F$31,2,FALSE)*F26>VLOOKUP(E26,Data!$A$11:$F$31,4,FALSE),VLOOKUP(E26,Data!$A$11:$F$31,4,FALSE),ROUND(VLOOKUP(E26,Data!$A$11:$F$31,2,FALSE)*F26,0))))),\"\"))","v":""},null,25,null,null,null,{"$f":"IF('Algemene gegevens'!C24=\"\",\"\",'Algemene gegevens'!C24)","v":""},{"$f":"IF('Algemene gegevens'!D24=\"\",\"\",'Algemene gegevens'!D24)","v":""},null,null,null,null,0,null,null,null,null,0,0,0,1,1,1,{"$f":"IF(F26=\"\",\"\",IF((VLOOKUP($E26,Data!$A$11:$F$31,6,FALSE)=1),ROUND(VLOOKUP($E26,Data!$A$11:$F$31,5,FALSE),0),IF((VLOOKUP($E26,Data!$A$11:$F$31,6,FALSE)=2),ROUND(VLOOKUP($E26,Data!$A$11:$F$31,5,FALSE),0),\"\")))","v":""},{"$f":"IF($F26=\"\",\"\",IF(VLOOKUP($E26,Data!$A$11:$F$31,6,FALSE)=1,$AE26*LOOKUP($J26,zelfregelbaarheidsklasse,zelfregelbaarheidsfactor),\"\"))","v":""},0,-1]
[null,null,{"$f":"IF('Algemene gegevens'!C25=\"\",\"\",'Algemene gegevens'!C25)","v":""},{"$f":"IF('Algemene gegevens'!D25=\"\",\"\",'Algemene gegevens'!D25)","v":""},{"$f":"IF('Algemene gegevens'!E25=\"\",\"\",'Algemene gegevens'!E25)","v":""},{"$f":"IF('Algemene gegevens'!F25=\"\",\"\",'Algemene gegevens'!F25)","v":""},{"$f":"IF(E27=\"\",\"\",IF((VLOOKUP(E27,Data!$A$11:$F$31,6,FALSE)=1),IF(E27=\"\",\"\",(IF(VLOOKUP(E27,Data!$A$11:$D$31,2,FALSE)*F27<VLOOKUP(E27,Data!$A$11:$D$31,3,FALSE),ROUND(VLOOKUP(E27,Data!$A$11:$D$31,3,FALSE),0),IF(VLOOKUP(E27,Data!$A$11:$D$31,2,FALSE)*F27>VLOOKUP(E27,Data!$A$11:$D$31,4,FALSE),ROUND(VLOOKUP(E27,Data!$A$11:$D$31,4,FALSE),0),ROUND(VLOOKUP(E27,Data!$A$11:$D$31,2,FALSE)*F27,0))))),\"\"))","v":""},{"$f":"IF(E27=\"\",\"\",IF((VLOOKUP(E27,Data!$A$11:$F$31,6,FALSE)=1),IF((2*(VLOOKUP(E27,Data!$A$11:$D$31,2,FALSE)*F27))<(2*(VLOOKUP(E27,Data!$A$11:$D$31,3,FALSE))),ROUND(2*(VLOOKUP(E27,Data!$A$11:$D$31,3,FALSE)),0),ROUND(2*(VLOOKUP(E27,Data!$A$11:$D$31,2,FALSE))*F27,0)),\"\"))","v":""},null,"P0",{"$f":"IF(F27=\"\",\"\",IF((VLOOKUP(E27,Data!$A$11:$F$31,6,FALSE)=1),ROUND(VLOOKUP($E27,Data!$A$11:$F$31,5,FALSE),0),\"\"))","v":""},{"$f":"IF(F27=\"\",\"\",IF((VLOOKUP(E27,Data!$A$11:$F$31,6,FALSE)=2),ROUND(VLOOKUP($E27,Data!$A$11:$F$31,5,FALSE),0),\"\"))","v":""},null,{"$f":"IF(E27=\"\",\"\",IF((VLOOKUP(E27,Data!$A$11:$F$31,6,FALSE)=2),IF(E27=\"\",\"\",(IF(VLOOKUP(E27,Data!$A$11:$F$31,2,FALSE)*F27<VLOOKUP(E27,Data!$A$11:$F$31,3,FALSE),VLOOKUP(E27,Data!$A$11:$F$31,3,FALSE),IF(VLOOKUP(E27,Data!$A$11:$F$31,2,FALSE)*F27>VLOOKUP(E27,Data!$A$11:$F$31,4,FALSE),VLOOKUP(E27,Data!$A$11:$F$31,4,FALSE),ROUND(VLOOKUP(E27,Data!$A$11:$F$31,2,FALSE)*F27,0))))),\"\"))","v":""},null,null,null,null,null,{"$f":"IF('Algemene gegevens'!C25=\"\",\"\",'Algemene gegevens'!C25)","v":""},{"$f":"IF('Algemene gegevens'!D25=\"\",\"\",'Algemene gegevens'!D25)","v":""},null,null,null,null,0,null,null,null,null,0,0,0,1,1,1,{"$f":"IF(F27=\"\",\"\",IF((VLOOKUP($E27,Data!$A$11:$F$31,6,FALSE)=1),ROUND(VLOOKUP($E27,Data!$A$11:$F$31,5,FALSE),0),IF((VLOOKUP($E27,Data!$A$11:$F$31,6,FALSE)=2),ROUND(VLOOKUP($E27,Data!$A$11:$F$31,5,FALSE),0),\"\")))","v":""},{"$f":"IF($F27=\"\",\"\",IF(VLOOKUP($E27,Data!$A$11:$F$31,6,FALSE)=1,$AE27*LOOKUP($J27,zelfregelbaarheidsklasse,zelfregelbaarheidsfactor),\"\"))","v":""},0,-1]
[null,null,{"$f":"IF('Algemene gegevens'!C26=\"\",\"\",'Algemene gegevens'!C26)","v":""},{"$f":"IF('Algemene gegevens'!D26=\"\",\"\",'Algemene gegevens'!D26)","v":""},{"$f":"IF('Algemene gegevens'!E26=\"\",\"\",'Algemene gegevens'!E26)","v":""},{"$f":"IF('Algemene gegevens'!F26=\"\",\"\",'Algemene gegevens'!F26)","v":""},{"$f":"IF(E28=\"\",\"\",IF((VLOOKUP(E28,Data!$A$11:$F$31,6,FALSE)=1),IF(E28=\"\",\"\",(IF(VLOOKUP(E28,Data!$A$11:$D$31,2,FALSE)*F28<VLOOKUP(E28,Data!$A$11:$D$31,3,FALSE),ROUND(VLOOKUP(E28,Data!$A$11:$D$31,3,FALSE),0),IF(VLOOKUP(E28,Data!$A$11:$D$31,2,FALSE)*F28>VLOOKUP(E28,Data!$A$11:$D$31,4,FALSE),ROUND(VLOOKUP(E28,Data!$A$11:$D$31,4,FALSE),0),ROUND(VLOOKUP(E28,Data!$A$11:$D$31,2,FALSE)*F28,0))))),\"\"))","v":""},{"$f":"IF(E28=\"\",\"\",IF((VLOOKUP(E28,Data!$A$11:$F$31,6,FALSE)=1),IF((2*(VLOOKUP(E28,Data!$A$11:$D$31,2,FALSE)*F28))<(2*(VLOOKUP(E28,Data!$A$11:$D$31,3,FALSE))),ROUND(2*(VLOOKUP(E28,Data!$A$11:$D$31,3,FALSE)),0),ROUND(2*(VLOOKUP(E28,Data!$A$11:$D$31,2,FALSE))*F28,0)),\"\"))","v":""},null,"P0",{"$f":"IF(F28=\"\",\"\",IF((VLOOKUP(E28,Data!$A$11:$F$31,6,FALSE)=1),ROUND(VLOOKUP($E28,Data!$A$11:$F$31,5,FALSE),0),\"\"))","v":""},{"$f":"IF(F28=\"\",\"\",IF((VLOOKUP(E28,Data!$A$11:$F$31,6,FALSE)=2),ROUND(VLOOKUP($E28,Data!$A$11:$F$31,5,FALSE),0),\"\"))","v":""},null,{"$f":"IF(E28=\"\",\"\",IF((VLOOKUP(E28,Data!$A$11:$F$31,6,FALSE)=2),IF(E28=\"\",\"\",(IF(VLOOKUP(E28,Data!$A$11:$F$31,2,FALSE)*F28<VLOOKUP(E28,Data!$A$11:$F$31,3,FALSE),VLOOKUP(E28,Data!$A$11:$F$31,3,FALSE),IF(VLOOKUP(E28,Data!$A$11:$F$31,2,FALSE)*F28>VLOOKUP(E28,Data!$A$11:$F$31,4,FALSE),VLOOKUP(E28,Data!$A$11:$F$31,4,FALSE),ROUND(VLOOKUP(E28,Data!$A$11:$F$31,2,FALSE)*F28,0))))),\"\"))","v":""},null,null,null,null,null,{"$f":"IF('Algemene gegevens'!C26=\"\",\"\",'Algemene gegevens'!C26)","v":""},{"$f":"IF('Algemene gegevens'!D26=\"\",\"\",'Algemene gegevens'!D26)","v":""},null,null,null,null,0,null,null,null,null,0,0,0,1,1,1,{"$f":"IF(F28=\"\",\"\",IF((VLOOKUP($E28,Data!$A$11:$F$31,6,FALSE)=1),ROUND(VLOOKUP($E28,Data!$A$11:$F$31,5,FALSE),0),IF((VLOOKUP($E28,Data!$A$11:$F$31,6,FALSE)=2),ROUND(VLOOKUP($E28,Data!$A$11:$F$31,5,FALSE),0),\"\")))","v":""},{"$f":"IF($F28=\"\",\"\",IF(VLOOKUP($E28,Data!$A$11:$F$31,6,FALSE)=1,$AE28*LOOKUP($J28,zelfregelbaarheidsklasse,zelfregelbaarheidsfactor),\"\"))","v":""},0,-1]
[null,null,{"$f":"IF('Algemene gegevens'!C27=\"\",\"\",'Algemene gegevens'!C27)","v":""},{"$f":"IF('Algemene gegevens'!D27=\"\",\"\",'Algemene gegevens'!D27)","v":""},{"$f":"IF('Algemene gegevens'!E27=\"\",\"\",'Algemene gegevens'!E27)","v":""},{"$f":"IF('Algemene gegevens'!F27=\"\",\"\",'Algemene gegevens'!F27)","v":""},{"$f":"IF(E29=\"\",\"\",IF((VLOOKUP(E29,Data!$A$11:$F$31,6,FALSE)=1),IF(E29=\"\",\"\",(IF(VLOOKUP(E29,Data!$A$11:$D$31,2,FALSE)*F29<VLOOKUP(E29,Data!$A$11:$D$31,3,FALSE),ROUND(VLOOKUP(E29,Data!$A$11:$D$31,3,FALSE),0),IF(VLOOKUP(E29,Data!$A$11:$D$31,2,FALSE)*F29>VLOOKUP(E29,Data!$A$11:$D$31,4,FALSE),ROUND(VLOOKUP(E29,Data!$A$11:$D$31,4,FALSE),0),ROUND(VLOOKUP(E29,Data!$A$11:$D$31,2,FALSE)*F29,0))))),\"\"))","v":""},{"$f":"IF(E29=\"\",\"\",IF((VLOOKUP(E29,Data!$A$11:$F$31,6,FALSE)=1),IF((2*(VLOOKUP(E29,Data!$A$11:$D$31,2,FALSE)*F29))<(2*(VLOOKUP(E29,Data!$A$11:$D$31,3,FALSE))),ROUND(2*(VLOOKUP(E29,Data!$A$11:$D$31,3,FALSE)),0),ROUND(2*(VLOOKUP(E29,Data!$A$11:$D$31,2,FALSE))*F29,0)),\"\"))","v":""},null,"P0",{"$f":"IF(F29=\"\",\"\",IF((VLOOKUP(E29,Data!$A$11:$F$31,6,FALSE)=1),ROUND(VLOOKUP($E29,Data!$A$11:$F$31,5,FALSE),0),\"\"))","v":""},{"$f":"IF(F29=\"\",\"\",IF((VLOOKUP(E29,Data!$A$11:$F$31,6,FALSE)=2),ROUND(VLOOKUP($E29,Data!$A$11:$F$31,5,FALSE),0),\"\"))","v":""},null,{"$f":"IF(E29=\"\",\"\",IF((VLOOKUP(E29,Data!$A$11:$F$31,6,FALSE)=2),IF(E29=\"\",\"\",(IF(VLOOKUP(E29,Data!$A$11:$F$31,2,FALSE)*F29<VLOOKUP(E29,Data!$A$11:$F$31,3,FALSE),VLOOKUP(E29,Data!$A$11:$F$31,3,FALSE),IF(VLOOKUP(E29,Data!$A$11:$F$31,2,FALSE)*F29>VLOOKUP(E29,Data!$A$11:$F$31,4,FALSE),VLOOKUP(E29,Data!$A$11:$F$31,4,FALSE),ROUND(VLOOKUP(E29,Data!$A$11:$F$31,2,FALSE)*F29,0))))),\"\"))","v":""},null,null,null,null,null,{"$f":"IF('Algemene gegevens'!C27=\"\",\"\",'Algemene gegevens'!C27)","v":""},{"$f":"IF('Algemene gegevens'!D27=\"\",\"\",'Algemene gegevens'!D27)","v":""},null,null,null,null,0,null,null,null,null,0,0,0,1,1,1,{"$f":"IF(F29=\"\",\"\",IF((VLOOKUP($E29,Data!$A$11:$F$31,6,FALSE)=1),ROUND(VLOOKUP($E29,Data!$A$11:$F$31,5,FALSE),0),IF((VLOOKUP($E29,Data!$A$11:$F$31,6,FALSE)=2),ROUND(VLOOKUP($E29,Data!$A$11:$F$31,5,FALSE),0),\"\")))","v":""},{"$f":"IF($F29=\"\",\"\",IF(VLOOKUP($E29,Data!$A$11:$F$31,6,FALSE)=1,$AE29*LOOKUP($J29,zelfregelbaarheidsklasse,zelfregelbaarheidsfactor),\"\"))","v":""},0,-1]
[null,null,{"$f":"IF('Algemene gegevens'!C28=\"\",\"\",'Algemene gegevens'!C28)","v":""},{"$f":"IF('Algemene gegevens'!D28=\"\",\"\",'Algemene gegevens'!D28)","v":""},{"$f":"IF('Algemene gegevens'!E28=\"\",\"\",'Algemene gegevens'!E28)","v":""},{"$f":"IF('Algemene gegevens'!F28=\"\",\"\",'Algemene gegevens'!F28)","v":""},{"$f":"IF(E30=\"\",\"\",IF((VLOOKUP(E30,Data!$A$11:$F$31,6,FALSE)=1),IF(E30=\"\",\"\",(IF(VLOOKUP(E30,Data!$A$11:$D$31,2,FALSE)*F30<VLOOKUP(E30,Data!$A$11:$D$31,3,FALSE),ROUND(VLOOKUP(E30,Data!$A$11:$D$31,3,FALSE),0),IF(VLOOKUP(E30,Data!$A$11:$D$31,2,FALSE)*F30>VLOOKUP(E30,Data!$A$11:$D$31,4,FALSE),ROUND(VLOOKUP(E30,Data!$A$11:$D$31,4,FALSE),0),ROUND(VLOOKUP(E30,Data!$A$11:$D$31,2,FALSE)*F30,0))))),\"\"))","v":""},{"$f":"IF(E30=\"\",\"\",IF((VLOOKUP(E30,Data!$A$11:$F$31,6,FALSE)=1),IF((2*(VLOOKUP(E30,Data!$A$11:$D$31,2,FALSE)*F30))<(2*(VLOOKUP(E30,Data!$A$11:$D$31,3,FALSE))),ROUND(2*(VLOOKUP(E30,Data!$A$11:$D$31,3,FALSE)),0),ROUND(2*(VLOOKUP(E30,Data!$A$11:$D$31,2,FALSE))*F30,0)),\"\"))","v":""},null,"P0",{"$f":"IF(F30=\"\",\"\",IF((VLOOKUP(E30,Data!$A$11:$F$31,6,FALSE)=1),ROUND(VLOOKUP($E30,Data!$A$11:$F$31,5,FALSE),0),\"\"))","v":""},{"$f":"IF(F30=\"\",\"\",IF((VLOOKUP(E30,Data!$A$11:$F$31,6,FALSE)=2),ROUND(VLOOKUP($E30,Data!$A$11:$F$31,5,FALSE),0),\"\"))","v":""},null,{"$f":"IF(E30=\"\",\"\",IF((VLOOKUP(E30,Data!$A$11:$F$31,6,FALSE)=2),IF(E30=\"\",\"\",(IF(VLOOKUP(E30,Data!$A$11:$F$31,2,FALSE)*F30<VLOOKUP(E30,Data!$A$11:$F$31,3,FALSE),VLOOKUP(E30,Data!$A$11:$F$31,3,FALSE),IF(VLOOKUP(E30,Data!$A$11:$F$31,2,FALSE)*F30>VLOOKUP(E30,Data!$A$11:$F$31,4,FALSE),VLOOKUP(E30,Data!$A$11:$F$31,4,FALSE),ROUND(VLOOKUP(E30,Data!$A$11:$F$31,2,FALSE)*F30,0))))),\"\"))","v":""},null,null,null,null,null,{"$f":"IF('Algemene gegevens'!C28=\"\",\"\",'Algemene gegevens'!C28)","v":""},{"$f":"IF('Algemene gegevens'!D28=\"\",\"\",'Algemene gegevens'!D28)","v":""},null,null,null,null,0,null,null,null,null,0,0,0,1,1,1,{"$f":"IF(F30=\"\",\"\",IF((VLOOKUP($E30,Data!$A$11:$F$31,6,FALSE)=1),ROUND(VLOOKUP($E30,Data!$A$11:$F$31,5,FALSE),0),IF((VLOOKUP($E30,Data!$A$11:$F$31,6,FALSE)=2),ROUND(VLOOKUP($E30,Data!$A$11:$F$31,5,FALSE),0),\"\")))","v":""},{"$f":"IF($F30=\"\",\"\",IF(VLOOKUP($E30,Data!$A$11:$F$31,6,FALSE)=1,$AE30*LOOKUP($J30,zelfregelbaarheidsklasse,zelfregelbaarheidsfactor),\"\"))","v":""},0,-1]
[null,null,{"$f":"IF('Algemene gegevens'!C29=\"\",\"\",'Algemene gegevens'!C29)","v":""},{"$f":"IF('Algemene gegevens'!D29=\"\",\"\",'Algemene gegevens'!D29)","v":""},{"$f":"IF('Algemene gegevens'!E29=\"\",\"\",'Algemene gegevens'!E29)","v":""},{"$f":"IF('Algemene gegevens'!F29=\"\",\"\",'Algemene gegevens'!F29)","v":""},{"$f":"IF(E31=\"\",\"\",IF((VLOOKUP(E31,Data!$A$11:$F$31,6,FALSE)=1),IF(E31=\"\",\"\",(IF(VLOOKUP(E31,Data!$A$11:$D$31,2,FALSE)*F31<VLOOKUP(E31,Data!$A$11:$D$31,3,FALSE),ROUND(VLOOKUP(E31,Data!$A$11:$D$31,3,FALSE),0),IF(VLOOKUP(E31,Data!$A$11:$D$31,2,FALSE)*F31>VLOOKUP(E31,Data!$A$11:$D$31,4,FALSE),ROUND(VLOOKUP(E31,Data!$A$11:$D$31,4,FALSE),0),ROUND(VLOOKUP(E31,Data!$A$11:$D$31,2,FALSE)*F31,0))))),\"\"))","v":""},{"$f":"IF(E31=\"\",\"\",IF((VLOOKUP(E31,Data!$A$11:$F$31,6,FALSE)=1),IF((2*(VLOOKUP(E31,Data!$A$11:$D$31,2,FALSE)*F31))<(2*(VLOOKUP(E31,Data!$A$11:$D$31,3,FALSE))),ROUND(2*(VLOOKUP(E31,Data!$A$11:$D$31,3,FALSE)),0),ROUND(2*(VLOOKUP(E31,Data!$A$11:$D$31,2,FALSE))*F31,0)),\"\"))","v":""},null,"P0",{"$f":"IF(F31=\"\",\"\",IF((VLOOKUP(E31,Data!$A$11:$F$31,6,FALSE)=1),ROUND(VLOOKUP($E31,Data!$A$11:$F$31,5,FALSE),0),\"\"))","v":""},{"$f":"IF(F31=\"\",\"\",IF((VLOOKUP(E31,Data!$A$11:$F$31,6,FALSE)=2),ROUND(VLOOKUP($E31,Data!$A$11:$F$31,5,FALSE),0),\"\"))","v":""},null,{"$f":"IF(E31=\"\",\"\",IF((VLOOKUP(E31,Data!$A$11:$F$31,6,FALSE)=2),IF(E31=\"\",\"\",(IF(VLOOKUP(E31,Data!$A$11:$F$31,2,FALSE)*F31<VLOOKUP(E31,Data!$A$11:$F$31,3,FALSE),VLOOKUP(E31,Data!$A$11:$F$31,3,FALSE),IF(VLOOKUP(E31,Data!$A$11:$F$31,2,FALSE)*F31>VLOOKUP(E31,Data!$A$11:$F$31,4,FALSE),VLOOKUP(E31,Data!$A$11:$F$31,4,FALSE),ROUND(VLOOKUP(E31,Data!$A$11:$F$31,2,FALSE)*F31,0))))),\"\"))","v":""},null,null,null,null,null,{"$f":"IF('Algemene gegevens'!C29=\"\",\"\",'Algemene gegevens'!C29)","v":""},{"$f":"IF('Algemene gegevens'!D29=\"\",\"\",'Algemene gegevens'!D29)","v":""},null,null,null,null,0,null,null,null,null,0,0,0,1,1,1,{"$f":"IF(F31=\"\",\"\",IF((VLOOKUP($E31,Data!$A$11:$F$31,6,FALSE)=1),ROUND(VLOOKUP($E31,Data!$A$11:$F$31,5,FALSE),0),IF((VLOOKUP($E31,Data!$A$11:$F$31,6,FALSE)=2),ROUND(VLOOKUP($E31,Data!$A$11:$F$31,5,FALSE),0),\"\")))","v":""},{"$f":"IF($F31=\"\",\"\",IF(VLOOKUP($E31,Data!$A$11:$F$31,6,FALSE)=1,$AE31*LOOKUP($J31,zelfregelbaarheidsklasse,zelfregelbaarheidsfactor),\"\"))","v":""},0,-1]
[null,null,{"$f":"IF('Algemene gegevens'!C30=\"\",\"\",'Algemene gegevens'!C30)","v":""},{"$f":"IF('Algemene gegevens'!D30=\"\",\"\",'Algemene gegevens'!D30)","v":""},{"$f":"IF('Algemene gegevens'!E30=\"\",\"\",'Algemene gegevens'!E30)","v":""},{"$f":"IF('Algemene gegevens'!F30=\"\",\"\",'Algemene gegevens'!F30)","v":""},{"$f":"IF(E32=\"\",\"\",IF((VLOOKUP(E32,Data!$A$11:$F$31,6,FALSE)=1),IF(E32=\"\",\"\",(IF(VLOOKUP(E32,Data!$A$11:$D$31,2,FALSE)*F32<VLOOKUP(E32,Data!$A$11:$D$31,3,FALSE),ROUND(VLOOKUP(E32,Data!$A$11:$D$31,3,FALSE),0),IF(VLOOKUP(E32,Data!$A$11:$D$31,2,FALSE)*F32>VLOOKUP(E32,Data!$A$11:$D$31,4,FALSE),ROUND(VLOOKUP(E32,Data!$A$11:$D$31,4,FALSE),0),ROUND(VLOOKUP(E32,Data!$A$11:$D$31,2,FALSE)*F32,0))))),\"\"))","v":""},{"$f":"IF(E32=\"\",\"\",IF((VLOOKUP(E32,Data!$A$11:$F$31,6,FALSE)=1),IF((2*(VLOOKUP(E32,Data!$A$11:$D$31,2,FALSE)*F32))<(2*(VLOOKUP(E32,Data!$A$11:$D$31,3,FALSE))),ROUND(2*(VLOOKUP(E32,Data!$A$11:$D$31,3,FALSE)),0),ROUND(2*(VLOOKUP(E32,Data!$A$11:$D$31,2,FALSE))*F32,0)),\"\"))","v":""},null,"P0",{"$f":"IF(F32=\"\",\"\",IF((VLOOKUP(E32,Data!$A$11:$F$31,6,FALSE)=1),ROUND(VLOOKUP($E32,Data!$A$11:$F$31,5,FALSE),0),\"\"))","v":""},{"$f":"IF(F32=\"\",\"\",IF((VLOOKUP(E32,Data!$A$11:$F$31,6,FALSE)=2),ROUND(VLOOKUP($E32,Data!$A$11:$F$31,5,FALSE),0),\"\"))","v":""},null,{"$f":"IF(E32=\"\",\"\",IF((VLOOKUP(E32,Data!$A$11:$F$31,6,FALSE)=2),IF(E32=\"\",\"\",(IF(VLOOKUP(E32,Data!$A$11:$F$31,2,FALSE)*F32<VLOOKUP(E32,Data!$A$11:$F$31,3,FALSE),VLOOKUP(E32,Data!$A$11:$F$31,3,FALSE),IF(VLOOKUP(E32,Data!$A$11:$F$31,2,FALSE)*F32>VLOOKUP(E32,Data!$A$11:$F$31,4,FALSE),VLOOKUP(E32,Data!$A$11:$F$31,4,FALSE),ROUND(VLOOKUP(E32,Data!$A$11:$F$31,2,FALSE)*F32,0))))),\"\"))","v":""},null,null,null,null,null,{"$f":"IF('Algemene gegevens'!C30=\"\",\"\",'Algemene gegevens'!C30)","v":""},{"$f":"IF('Algemene gegevens'!D30=\"\",\"\",'Algemene gegevens'!D30)","v":""},null,null,null,null,0,null,null,null,null,0,0,0,1,1,1,{"$f":"IF(F32=\"\",\"\",IF((VLOOKUP($E32,Data!$A$11:$F$31,6,FALSE)=1),ROUND(VLOOKUP($E32,Data!$A$11:$F$31,5,FALSE),0),IF((VLOOKUP($E32,Data!$A$11:$F$31,6,FALSE)=2),ROUND(VLOOKUP($E32,Data!$A$11:$F$31,5,FALSE),0),\"\")))","v":""},{"$f":"IF($F32=\"\",\"\",IF(VLOOKUP($E32,Data!$A$11:$F$31,6,FALSE)=1,$AE32*LOOKUP($J32,zelfregelbaarheidsklasse,zelfregelbaarheidsfactor),\"\"))","v":""},0,-1]
[null,null,{"$f":"IF('Algemene gegevens'!C31=\"\",\"\",'Algemene gegevens'!C31)","v":""},{"$f":"IF('Algemene gegevens'!D31=\"\",\"\",'Algemene gegevens'!D31)","v":""},{"$f":"IF('Algemene gegevens'!E31=\"\",\"\",'Algemene gegevens'!E31)","v":""},{"$f":"IF('Algemene gegevens'!F31=\"\",\"\",'Algemene gegevens'!F31)","v":""},{"$f":"IF(E33=\"\",\"\",IF((VLOOKUP(E33,Data!$A$11:$F$31,6,FALSE)=1),IF(E33=\"\",\"\",(IF(VLOOKUP(E33,Data!$A$11:$D$31,2,FALSE)*F33<VLOOKUP(E33,Data!$A$11:$D$31,3,FALSE),ROUND(VLOOKUP(E33,Data!$A$11:$D$31,3,FALSE),0),IF(VLOOKUP(E33,Data!$A$11:$D$31,2,FALSE)*F33>VLOOKUP(E33,Data!$A$11:$D$31,4,FALSE),ROUND(VLOOKUP(E33,Data!$A$11:$D$31,4,FALSE),0),ROUND(VLOOKUP(E33,Data!$A$11:$D$31,2,FALSE)*F33,0))))),\"\"))","v":""},{"$f":"IF(E33=\"\",\"\",IF((VLOOKUP(E33,Data!$A$11:$F$31,6,FALSE)=1),IF((2*(VLOOKUP(E33,Data!$A$11:$D$31,2,FALSE)*F33))<(2*(VLOOKUP(E33,Data!$A$11:$D$31,3,FALSE))),ROUND(2*(VLOOKUP(E33,Data!$A$11:$D$31,3,FALSE)),0),ROUND(2*(VLOOKUP(E33,Data!$A$11:$D$31,2,FALSE))*F33,0)),\"\"))","v":""},null,"P0",{"$f":"IF(F33=\"\",\"\",IF((VLOOKUP(E33,Data!$A$11:$F$31,6,FALSE)=1),ROUND(VLOOKUP($E33,Data!$A$11:$F$31,5,FALSE),0),\"\"))","v":""},{"$f":"IF(F33=\"\",\"\",IF((VLOOKUP(E33,Data!$A$11:$F$31,6,FALSE)=2),ROUND(VLOOKUP($E33,Data!$A$11:$F$31,5,FALSE),0),\"\"))","v":""},null,{"$f":"IF(E33=\"\",\"\",IF((VLOOKUP(E33,Data!$A$11:$F$31,6,FALSE)=2),IF(E33=\"\",\"\",(IF(VLOOKUP(E33,Data!$A$11:$F$31,2,FALSE)*F33<VLOOKUP(E33,Data!$A$11:$F$31,3,FALSE),VLOOKUP(E33,Data!$A$11:$F$31,3,FALSE),IF(VLOOKUP(E33,Data!$A$11:$F$31,2,FALSE)*F33>VLOOKUP(E33,Data!$A$11:$F$31,4,FALSE),VLOOKUP(E33,Data!$A$11:$F$31,4,FALSE),ROUND(VLOOKUP(E33,Data!$A$11:$F$31,2,FALSE)*F33,0))))),\"\"))","v":""},null,null,null,null,null,{"$f":"IF('Algemene gegevens'!C31=\"\",\"\",'Algemene gegevens'!C31)","v":""},{"$f":"IF('Algemene gegevens'!D31=\"\",\"\",'Algemene gegevens'!D31)","v":""},null,null,null,null,0,null,null,null,null,0,0,0,1,1,1,{"$f":"IF(F33=\"\",\"\",IF((VLOOKUP($E33,Data!$A$11:$F$31,6,FALSE)=1),ROUND(VLOOKUP($E33,Data!$A$11:$F$31,5,FALSE),0),IF((VLOOKUP($E33,Data!$A$11:$F$31,6,FALSE)=2),ROUND(VLOOKUP($E33,Data!$A$11:$F$31,5,FALSE),0),\"\")))","v":""},{"$f":"IF($F33=\"\",\"\",IF(VLOOKUP($E33,Data!$A$11:$F$31,6,FALSE)=1,$AE33*LOOKUP($J33,zelfregelbaarheidsklasse,zelfregelbaarheidsfactor),\"\"))","v":""},0,-1]
[null,null,{"$f":"IF('Algemene gegevens'!C32=\"\",\"\",'Algemene gegevens'!C32)","v":""},{"$f":"IF('Algemene gegevens'!D32=\"\",\"\",'Algemene gegevens'!D32)","v":""},{"$f":"IF('Algemene gegevens'!E32=\"\",\"\",'Algemene gegevens'!E32)","v":""},{"$f":"IF('Algemene gegevens'!F32=\"\",\"\",'Algemene gegevens'!F32)","v":""},{"$f":"IF(E34=\"\",\"\",IF((VLOOKUP(E34,Data!$A$11:$F$31,6,FALSE)=1),IF(E34=\"\",\"\",(IF(VLOOKUP(E34,Data!$A$11:$D$31,2,FALSE)*F34<VLOOKUP(E34,Data!$A$11:$D$31,3,FALSE),ROUND(VLOOKUP(E34,Data!$A$11:$D$31,3,FALSE),0),IF(VLOOKUP(E34,Data!$A$11:$D$31,2,FALSE)*F34>VLOOKUP(E34,Data!$A$11:$D$31,4,FALSE),ROUND(VLOOKUP(E34,Data!$A$11:$D$31,4,FALSE),0),ROUND(VLOOKUP(E34,Data!$A$11:$D$31,2,FALSE)*F34,0))))),\"\"))","v":""},{"$f":"IF(E34=\"\",\"\",IF((VLOOKUP(E34,Data!$A$11:$F$31,6,FALSE)=1),IF((2*(VLOOKUP(E34,Data!$A$11:$D$31,2,FALSE)*F34))<(2*(VLOOKUP(E34,Data!$A$11:$D$31,3,FALSE))),ROUND(2*(VLOOKUP(E34,Data!$A$11:$D$31,3,FALSE)),0),ROUND(2*(VLOOKUP(E34,Data!$A$11:$D$31,2,FALSE))*F34,0)),\"\"))","v":""},null,"P0",{"$f":"IF(F34=\"\",\"\",IF((VLOOKUP(E34,Data!$A$11:$F$31,6,FALSE)=1),ROUND(VLOOKUP($E34,Data!$A$11:$F$31,5,FALSE),0),\"\"))","v":""},{"$f":"IF(F34=\"\",\"\",IF((VLOOKUP(E34,Data!$A$11:$F$31,6,FALSE)=2),ROUND(VLOOKUP($E34,Data!$A$11:$F$31,5,FALSE),0),\"\"))","v":""},null,{"$f":"IF(E34=\"\",\"\",IF((VLOOKUP(E34,Data!$A$11:$F$31,6,FALSE)=2),IF(E34=\"\",\"\",(IF(VLOOKUP(E34,Data!$A$11:$F$31,2,FALSE)*F34<VLOOKUP(E34,Data!$A$11:$F$31,3,FALSE),VLOOKUP(E34,Data!$A$11:$F$31,3,FALSE),IF(VLOOKUP(E34,Data!$A$11:$F$31,2,FALSE)*F34>VLOOKUP(E34,Data!$A$11:$F$31,4,FALSE),VLOOKUP(E34,Data!$A$11:$F$31,4,FALSE),ROUND(VLOOKUP(E34,Data!$A$11:$F$31,2,FALSE)*F34,0))))),\"\"))","v":""},null,null,null,null,null,{"$f":"IF('Algemene gegevens'!C32=\"\",\"\",'Algemene gegevens'!C32)","v":""},{"$f":"IF('Algemene gegevens'!D32=\"\",\"\",'Algemene gegevens'!D32)","v":""},null,null,null,null,0,null,null,null,null,0,0,0,1,1,1,{"$f":"IF(F34=\"\",\"\",IF((VLOOKUP($E34,Data!$A$11:$F$31,6,FALSE)=1),ROUND(VLOOKUP($E34,Data!$A$11:$F$31,5,FALSE),0),IF((VLOOKUP($E34,Data!$A$11:$F$31,6,FALSE)=2),ROUND(VLOOKUP($E34,Data!$A$11:$F$31,5,FALSE),0),\"\")))","v":""},{"$f":"IF($F34=\"\",\"\",IF(VLOOKUP($E34,Data!$A$11:$F$31,6,FALSE)=1,$AE34*LOOKUP($J34,zelfregelbaarheidsklasse,zelfregelbaarheidsfactor),\"\"))","v":""},0,-1]
[null,null,null,null,null,"totalen",{"$f":"SUM(G14:G34)","v":0},{"$f":"SUM(H14:H34)","v":0},{"$f":"SUMPRODUCT(I14:I34,AE14:AE34)","v":0},null,null,null,null,{"$f":"SUM(N14:N34)","v":0},{"$f":"SUMPRODUCT(O14:O34,AE14:AE34)","v":0},{"$f":"IF(P9=\"ja\",SUMPRODUCT(P14:P34,AG14:AG34),\"\")","v":0},null,null,null,null,null,null,null,null,null,"geen controle op maximumdebiet!",null,null,null,null,null,null,null,null,null,null,null,{"$f":"MAX(AL14:AL34)","v":0},null,{"$f":"MAX(AN14:AN34)","v":-1}]
[]
[null,null,null,null,null,null,null,null,null,null,null,null,null,null,null,{"$f":"SUMPRODUCT(AF14:AF34,P14:P34)","v":0}]
[]
[]
[]
[null,null,"Lekdebieten kanalen"]
[null,null,null,null,null,null,null,null,null,null,null,null,null,null,null,"(m³/h)"]
[null,null,"Lekdebiet afvoerkanalen",null,null,null,null,null,null,null,null,null,null,null,"lekdebietsmeting?","ja"]
[null,null,null,null,null,null,null,null,null,null,null,null,null,null,null,null,null,null,null,null,null,null,null,null,null,null,null,null,null,null,null,null,null,null,null,null,"druk voor de ventilator (Pa)",null,null,"hoort tot stavingsstuk"]
[null,null,null,null,null,null,null,null,null,null,null,null,null,null,"ontstenteniswaarde",{"$f":"0.18*N35","v":0}]
[null,null,null,null,null,null,null,null,null,null,null,null,null,null,"maximaal gewenste waarde"]
[null,null,null,null,null,null,null,null,null,null,null,null,null,null,"gemeten:"]
[]
[null,null,null,null,null,null,null,null,null,null,null,null,null,null,null,null,null,null,null,null,null,null,null,null,null,null,null,null,null,null,null,null,null,null,null,null,null,null,"C"]
[null,null,"VERMENIGVULDIGINGSFACTOR m:",null,null,null,null,null,null,null,null,null,null,null,null,{"$f":"+IF(AJ4=\"A\",AJ50,IF(AJ4=\"B\",AK50,IF(AJ4=\"C\",AM50,IF(AJ4=\"D\",AN50,\"fout\"))))","v":1.5},null,null,null,null,null,null,null,null,null,null,null,null,null,null,null,null,null,null,null,null,null,null,{"$f":"1+0.5*((IF(AL35=0,0.2,AL35)+IF(P9=\"ja\",IF(AN35=0,0,IF(AN35=1,MAX(0,MIN(0.2,P37/N35-1.2)),0.2)),0.2)+IF(P43=\"nee\",0.18,IF(P47=\"\",0.18,MIN(P47/N35,0.18))))/0.58)","v":1.5}]
[null,null,"De vermenigvuldigingsfactor werd berekend volgens bijlage B.1 van bijlage I bij het EPB-besluit. "]
[]
[null,"HULPENERGIE VENTILATOREN",null,null,null,null,null,null,null,null,null,null,null,null,null,null,null,null,null,"VENTILATORKEUZE"]
[]
[null,null,"type ventilatoren",null,"gelijkstroomventilator (DC)"]
[null,null,null,null,null,"som van  afvoer",null,null,null,null,null,null,null,null,null,null,null,null,null,"Specificaties",null,"Gegevens"]
[null,null,"nominaal motorvermogen",null,null,null,"(W)",null,null,null,null,null,null,null,null,null,null,null,null,null,null,"Afvoer"]
[null,null,"maximaal vermogen",null,null,null,"(W)"]
[null,null,"vermogen bij werkingspunt",null,null,null,"(W)",null,null,null,null,null,null,null,null,null,null,null,null,"Benaming"]
[null,null,null,null,null,null,null,null,null,null,null,null,null,null,null,null,null,null,null,"Product-ID"]
[null,null,null,null,null,null,null,null,null,null,null,null,null,null,null,null,null,null,null,"Motortype"]
[null,null,null,null,null,null,null,null,null,null,null,null,null,null,null,null,null,null,null,"Vermogen:"]
[null,null,null,null,null,null,null,null,null,null,null,null,null,null,null,null,null,null,null,"     nominaal motorvermogen"]
[null,null,null,null,null,null,null,null,null,null,null,null,null,null,null,null,null,null,null,"     maximaal vermogen"]
[null,null,null,null,null,null,null,null,null,null,null,null,null,null,null,null,null,null,null,"     vermogen bij werkingspunt (grafiek)"]

{"sheet":"D","index":5,"n_rows":83,"n_cols":45,"rows_kept":83,"cut":false,"hidden":false,"merged":[[77,20,77,21],[82,20,82,21],[81,20,81,21],[80,20,80,21],[79,20,79,21],[72,4,72,5],[61,21,61,24],[78,20,78,21],[73,22,73,24],[73,20,73,21],[76,20,76,21],[9,6,9,15],[10,10,10,12],[3,4,3,9],[68,6,68,9],[35,10,36,12],[10,6,10,9],[10,13,10,15]]}
[]
[null,null,"Berekeningsblad VENTILATIE"]
[null,null,null,null,null,null,null,null,null,null,null,null,null,null,null,null,null,null,null,null,null,null,null,null,null,null,null,null,null,null,null,null,"hulptabel"]
[null,null,"Ventilatiesysteem",null,"D: mechanische toevoer, mechanische afvoer ",null,null,null,null,null,null,null,null,null,null,null,null,null,null,null,null,null,null,null,null,null,null,null,null,null,null,null,{"$f":"LOOKUP(E4,ventilatiesysteem,Data!B5:B8)","v":"D"},null,{"$f":"LOOKUP(E4,ventilatiesysteem,Data!C5:C8)","v":4}]
[]
[null,null,"SPECIFICATIEBLAD",null,null,null,null,null,null,null,null,null,null,null,null,null,null,null,null,null,"PRODUCTKEUZE",null,null,null,null,null,null,null,null,null,null,null,{"$f":"+P56","v":1.5}]
[]
[]
[null,null,null,null,null,null,"Recirculatie?","ja",null,"ja","debietsmeting?",null,null,null,"debietsmeting?","ja",null,null,null,null,null,null,null,null,null,null,null,null,null,null,null,null,{"$f":"IF(OR(AI4=1,AI4=3,P9=\"nee\"),\"zwart\",\"niet zwart\")","v":"niet zwart"}]
[null,null,null,null,null,null,"Debiet"]
[null,null,null,null,null,null,"Toevoer",null,null,null,"Doorstroom",null,null,"Afvoer"]
[null,null,"Naam","Code","Soort ruimte","Opp","opgelegd minimum","Recirculatie","ontwerp","gemeten","minimum (afvoer)","minimum (toevoer)","ontwerp","opgelegd minimum","ontwerp","gemeten",null,null,null,null,"Naam","Code","Toevoer","Doorstroom","Afvoer",null,null,null,null,"actief","actief","toevoer","actief","afvoer","Recirculatie","som","Balans","voldoende (1=ok, 0=nok)",null,null,"doorvoer","voldoende debiet",null,"meting","meting"]
[null,null,null,null,null,"(m²)","(m³/h)","(m³/h)","(m³/h)","(m³/h)","(m³/h)","(m³/h)","(m³/h)","(m³/h)","(m³/h)","(m³/h)",null,null,null,null,null,null,null,null,null,null,null,null,null,null,"toevoer","actief meting","afvoer","actief meting",null,null,"Toevoer/Afv","toevoer","doorvoer","afvoer","minimum","1=NOK","afvoer","toevoer","0=ts 100 en 120 %,1=>120%,2=<100%"]
[null,null,{"$f":"IF('Algemene gegevens'!C12=\"\",\"\",'Algemene gegevens'!C12)","v":""},{"$f":"IF('Algemene gegevens'!D12=\"\",\"\",'Algemene gegevens'!D12)","v":""},{"$f":"IF('Algemene gegevens'!E12=\"\",\"\",'Algemene gegevens'!E12)","v":""},{"$f":"IF('Algemene gegevens'!F12=\"\",\"\",'Algemene gegevens'!F12)","v":""},{"$f":"IF(E14=\"\",\"\",IF((VLOOKUP(E14,Data!$A$11:$F$31,6,FALSE)=1),IF(E14=\"\",\"\",(IF(VLOOKUP(E14,Data!$A$11:$D$31,2,FALSE)*F14<VLOOKUP(E14,Data!$A$11:$D$31,3,FALSE),ROUND(VLOOKUP(E14,Data!$A$11:$D$31,3,FALSE),0),IF(VLOOKUP(E14,Data!$A$11:$D$31,2,FALSE)*F14>VLOOKUP(E14,Data!$A$11:$D$31,4,FALSE),ROUND(VLOOKUP(E14,Data!$A$11:$D$31,4,FALSE),0),ROUND(VLOOKUP(E14,Data!$A$11:$D$31,2,FALSE)*F14,0))))),\"\"))","v":""},null,null,null,{"$f":"IF(E14=\"\",\"\",IF((VLOOKUP($E14,Data!$A$11:$F$31,6,FALSE)=1),ROUND(VLOOKUP($E14,Data!$A$11:$F$31,5,FALSE),0),\"\"))","v":""},{"$f":"IF(E14=\"\",\"\",IF((VLOOKUP($E14,Data!$A$11:$F$31,6,FALSE)=2),ROUND(VLOOKUP($E14,Data!$A$11:$F$31,5,FALSE),0),\"\"))","v":""},null,{"$f":"IF($E14=\"\",\"\",IF((VLOOKUP($E14,Data!$A$11:$F$31,6,FALSE)=2),IF($E14=\"\",\"\",(IF(VLOOKUP($E14,Data!$A$11:$F$31,2,FALSE)*$F14<VLOOKUP($E14,Data!$A$11:$F$31,3,FALSE),VLOOKUP($E14,Data!$A$11:$F$31,3,FALSE),IF(VLOOKUP($E14,Data!$A$11:$F$31,2,FALSE)*$F14>VLOOKUP($E14,Data!$A$11:$F$31,4,FALSE),VLOOKUP($E14,Data!$A$11:$F$31,4,FALSE),ROUND(VLOOKUP($E14,Data!$A$11:$F$31,2,FALSE)*$F14,0))))),\"\"))","v":""},null,55,null,null,null,null,{"$f":"IF('Algemene gegevens'!$C12=\"\",\"\",'Algemene gegevens'!$C12)","v":""},{"$f":"IF('Algemene gegevens'!$D12=\"\",\"\",'Algemene gegevens'!$D12)","v":""},null,null,null,null,null,null,null,{"$f":"IF(F14=\"\",0,1)","v":0},{"$f":"IF($F14=\"\",0,IF(VLOOKUP($E14,Data!$A$11:$F$31,6,FALSE)=1,1,0))","v":0},{"$f":"IF($J$9=\"nee\",0,IF(F14=\"\",0,IF(OR(G14<>\"\",I14<>\"\"),1,0)))","v":0},{"$f":"IF($F14=\"\",0,IF(VLOOKUP($E14,Data!$A$11:$F$31,6,FALSE)=2,1,0))","v":0},{"$f":"IF($P$9=\"nee\",0,IF(F14=\"\",0,IF(OR(N14<>\"\",O14<>\"\"),1,0)))","v":0},{"$f":"IF($H$9=\"ja\",IF(E14=\"woonkamer\",1,0),0)","v":0},{"$f":"SUM(IF($H$9=\"ja\",IF(H14<>\"\",SUMPRODUCT(H14,AI14),0),0),I14)","v":0},null,{"$f":"IF(G14=\"\",1,IF(AJ14<G14,0,1))","v":1},{"$f":"IF(AO14=\"\",1,IF(M14<AO14,0,1))","v":1},{"$f":"IF(N14=\"\",1,IF(O14<N14,0,1))","v":1},{"$f":"IF(F14=\"\",\"\",IF((VLOOKUP($E14,Data!$A$11:$F$31,6,FALSE)=1),ROUND(VLOOKUP($E14,Data!$A$11:$F$31,5,FALSE),0),IF((VLOOKUP($E14,Data!$A$11:$F$31,6,FALSE)=2),ROUND(VLOOKUP($E14,Data!$A$11:$F$31,5,FALSE),0),\"\")))","v":""},{"$f":"AE14*IF(I14<G14,1,0)","v":0},{"$f":"AG14*IF(P14<N14,1,0)","v":0},{"$f":"IF(G14=\"\",-1,IF($J$9=\"ja\",AE14*IF(AND(J14>=G14,J14<=G14*1.2),0,IF(J14>=G14*1.2,1,2)),0))","v":-1},{"$f":"IF(N14=\"\",-1,IF($P$9=\"ja\",AG14*IF(AND(P14>=N14,P14<=N14*1.2),0,IF(P14>=N14*1.2,1,2)),0))","v":-1}]
[null,null,{"$f":"IF('Algemene gegevens'!C13=\"\",\"\",'Algemene gegevens'!C13)","v":""},{"$f":"IF('Algemene gegevens'!D13=\"\",\"\",'Algemene gegevens'!D13)","v":""},{"$f":"IF('Algemene gegevens'!E13=\"\",\"\",'Algemene gegevens'!E13)","v":""},{"$f":"IF('Algemene gegevens'!F13=\"\",\"\",'Algemene gegevens'!F13)","v":""},{"$f":"IF(E15=\"\",\"\",IF((VLOOKUP(E15,Data!$A$11:$F$31,6,FALSE)=1),IF(E15=\"\",\"\",(IF(VLOOKUP(E15,Data!$A$11:$D$31,2,FALSE)*F15<VLOOKUP(E15,Data!$A$11:$D$31,3,FALSE),ROUND(VLOOKUP(E15,Data!$A$11:$D$31,3,FALSE),0),IF(VLOOKUP(E15,Data!$A$11:$D$31,2,FALSE)*F15>VLOOKUP(E15,Data!$A$11:$D$31,4,FALSE),ROUND(VLOOKUP(E15,Data!$A$11:$D$31,4,FALSE),0),ROUND(VLOOKUP(E15,Data!$A$11:$D$31,2,FALSE)*F15,0))))),\"\"))","v":""},75,null,125,{"$f":"IF(E15=\"\",\"\",IF((VLOOKUP($E15,Data!$A$11:$F$31,6,FALSE)=1),ROUND(VLOOKUP($E15,Data!$A$11:$F$31,5,FALSE),0),\"\"))","v":""},{"$f":"IF(E15=\"\",\"\",IF((VLOOKUP($E15,Data!$A$11:$F$31,6,FALSE)=2),ROUND(VLOOKUP($E15,Data!$A$11:$F$31,5,FALSE),0),\"\"))","v":""},null,{"$f":"IF($E15=\"\",\"\",IF((VLOOKUP($E15,Data!$A$11:$F$31,6,FALSE)=2),IF($E15=\"\",\"\",(IF(VLOOKUP($E15,Data!$A$11:$F$31,2,FALSE)*$F15<VLOOKUP($E15,Data!$A$11:$F$31,3,FALSE),VLOOKUP($E15,Data!$A$11:$F$31,3,FALSE),IF(VLOOKUP($E15,Data!$A$11:$F$31,2,FALSE)*$F15>VLOOKUP($E15,Data!$A$11:$F$31,4,FALSE),VLOOKUP($E15,Data!$A$11:$F$31,4,FALSE),ROUND(VLOOKUP($E15,Data!$A$11:$F$31,2,FALSE)*$F15,0))))),\"\"))","v":""},null,null,null,null,null,null,{"$f":"IF('Algemene gegevens'!$C13=\"\",\"\",'Algemene gegevens'!$C13)","v":""},{"$f":"IF('Algemene gegevens'!$D13=\"\",\"\",'Algemene gegevens'!$D13)","v":""},null,null,null,null,null,null,null,{"$f":"IF(F15=\"\",0,1)","v":0},{"$f":"IF($F15=\"\",0,IF(VLOOKUP($E15,Data!$A$11:$F$31,6,FALSE)=1,1,0))","v":0},{"$f":"IF($J$9=\"nee\",0,IF(F15=\"\",0,IF(OR(G15<>\"\",I15<>\"\"),1,0)))","v":0},{"$f":"IF($F15=\"\",0,IF(VLOOKUP($E15,Data!$A$11:$F$31,6,FALSE)=2,1,0))","v":0},{"$f":"IF($P$9=\"nee\",0,IF(F15=\"\",0,IF(OR(N15<>\"\",O15<>\"\"),1,0)))","v":0},{"$f":"IF($H$9=\"ja\",IF(E15=\"woonkamer\",1,0),0)","v":0},{"$f":"SUM(IF($H$9=\"ja\",IF(H15<>\"\",SUMPRODUCT(H15,AI15),0),0),I15)","v":0},null,{"$f":"IF(G15=\"\",1,IF(AJ15<G15,0,1))","v":1},{"$f":"IF(AO15=\"\",1,IF(M15<AO15,0,1))","v":1},{"$f":"IF(N15=\"\",1,IF(O15<N15,0,1))","v":1},{"$f":"IF(F15=\"\",\"\",IF((VLOOKUP($E15,Data!$A$11:$F$31,6,FALSE)=1),ROUND(VLOOKUP($E15,Data!$A$11:$F$31,5,FALSE),0),IF((VLOOKUP($E15,Data!$A$11:$F$31,6,FALSE)=2),ROUND(VLOOKUP($E15,Data!$A$11:$F$31,5,FALSE),0),\"\")))","v":""},0,0,-1,{"$f":"IF(N15=\"\",-1,IF($P$9=\"ja\",AG15*IF(AND(P15>=N15,P15<=N15*1.2),0,IF(P15>=N15*1.2,1,2)),0))","v":-1}]
[null,null,{"$f":"IF('Algemene gegevens'!C14=\"\",\"\",'Algemene gegevens'!C14)","v":""},{"$f":"IF('Algemene gegevens'!D14=\"\",\"\",'Algemene gegevens'!D14)","v":""},{"$f":"IF('Algemene gegevens'!E14=\"\",\"\",'Algemene gegevens'!E14)","v":""},{"$f":"IF('Algemene gegevens'!F14=\"\",\"\",'Algemene gegevens'!F14)","v":""},{"$f":"IF(E16=\"\",\"\",IF((VLOOKUP(E16,Data!$A$11:$F$31,6,FALSE)=1),IF(E16=\"\",\"\",(IF(VLOOKUP(E16,Data!$A$11:$D$31,2,FALSE)*F16<VLOOKUP(E16,Data!$A$11:$D$31,3,FALSE),ROUND(VLOOKUP(E16,Data!$A$11:$D$31,3,FALSE),0),IF(VLOOKUP(E16,Data!$A$11:$D$31,2,FALSE)*F16>VLOOKUP(E16,Data!$A$11:$D$31,4,FALSE),ROUND(VLOOKUP(E16,Data!$A$11:$D$31,4,FALSE),0),ROUND(VLOOKUP(E16,Data!$A$11:$D$31,2,FALSE)*F16,0))))),\"\"))","v":""},null,null,45,{"$f":"IF(E16=\"\",\"\",IF((VLOOKUP($E16,Data!$A$11:$F$31,6,FALSE)=1),ROUND(VLOOKUP($E16,Data!$A$11:$F$31,5,FALSE),0),\"\"))","v":""},{"$f":"IF(E16=\"\",\"\",IF((VLOOKUP($E16,Data!$A$11:$F$31,6,FALSE)=2),ROUND(VLOOKUP($E16,Data!$A$11:$F$31,5,FALSE),0),\"\"))","v":""},null,{"$f":"IF($E16=\"\",\"\",IF((VLOOKUP($E16,Data!$A$11:$F$31,6,FALSE)=2),IF($E16=\"\",\"\",(IF(VLOOKUP($E16,Data!$A$11:$F$31,2,FALSE)*$F16<VLOOKUP($E16,Data!$A$11:$F$31,3,FALSE),VLOOKUP($E16,Data!$A$11:$F$31,3,FALSE),IF(VLOOKUP($E16,Data!$A$11:$F$31,2,FALSE)*$F16>VLOOKUP($E16,Data!$A$11:$F$31,4,FALSE),VLOOKUP($E16,Data!$A$11:$F$31,4,FALSE),ROUND(VLOOKUP($E16,Data!$A$11:$F$31,2,FALSE)*$F16,0))))),\"\"))","v":""},null,null,null,null,null,null,{"$f":"IF('Algemene gegevens'!$C14=\"\",\"\",'Algemene gegevens'!$C14)","v":""},{"$f":"IF('Algemene gegevens'!$D14=\"\",\"\",'Algemene gegevens'!$D14)","v":""},null,null,null,null,null,null,null,0,{"$f":"IF($F16=\"\",0,IF(VLOOKUP($E16,Data!$A$11:$F$31,6,FALSE)=1,1,0))","v":0},0,{"$f":"IF($F16=\"\",0,IF(VLOOKUP($E16,Data!$A$11:$F$31,6,FALSE)=2,1,0))","v":0},0,0,0,null,1,1,1,{"$f":"IF(F16=\"\",\"\",IF((VLOOKUP($E16,Data!$A$11:$F$31,6,FALSE)=1),ROUND(VLOOKUP($E16,Data!$A$11:$F$31,5,FALSE),0),IF((VLOOKUP($E16,Data!$A$11:$F$31,6,FALSE)=2),ROUND(VLOOKUP($E16,Data!$A$11:$F$31,5,FALSE),0),\"\")))","v":""},0,0,-1,-1]
[null,null,{"$f":"IF('Algemene gegevens'!C15=\"\",\"\",'Algemene gegevens'!C15)","v":""},{"$f":"IF('Algemene gegevens'!D15=\"\",\"\",'Algemene gegevens'!D15)","v":""},{"$f":"IF('Algemene gegevens'!E15=\"\",\"\",'Algemene gegevens'!E15)","v":""},{"$f":"IF('Algemene gegevens'!F15=\"\",\"\",'Algemene gegevens'!F15)","v":""},{"$f":"IF(E17=\"\",\"\",IF((VLOOKUP(E17,Data!$A$11:$F$31,6,FALSE)=1),IF(E17=\"\",\"\",(IF(VLOOKUP(E17,Data!$A$11:$D$31,2,FALSE)*F17<VLOOKUP(E17,Data!$A$11:$D$31,3,FALSE),ROUND(VLOOKUP(E17,Data!$A$11:$D$31,3,FALSE),0),IF(VLOOKUP(E17,Data!$A$11:$D$31,2,FALSE)*F17>VLOOKUP(E17,Data!$A$11:$D$31,4,FALSE),ROUND(VLOOKUP(E17,Data!$A$11:$D$31,4,FALSE),0),ROUND(VLOOKUP(E17,Data!$A$11:$D$31,2,FALSE)*F17,0))))),\"\"))","v":""},null,null,null,{"$f":"IF(E17=\"\",\"\",IF((VLOOKUP($E17,Data!$A$11:$F$31,6,FALSE)=1),ROUND(VLOOKUP($E17,Data!$A$11:$F$31,5,FALSE),0),\"\"))","v":""},{"$f":"IF(E17=\"\",\"\",IF((VLOOKUP($E17,Data!$A$11:$F$31,6,FALSE)=2),ROUND(VLOOKUP($E17,Data!$A$11:$F$31,5,FALSE),0),\"\"))","v":""},null,{"$f":"IF($E17=\"\",\"\",IF((VLOOKUP($E17,Data!$A$11:$F$31,6,FALSE)=2),IF($E17=\"\",\"\",(IF(VLOOKUP($E17,Data!$A$11:$F$31,2,FALSE)*$F17<VLOOKUP($E17,Data!$A$11:$F$31,3,FALSE),VLOOKUP($E17,Data!$A$11:$F$31,3,FALSE),IF(VLOOKUP($E17,Data!$A$11:$F$31,2,FALSE)*$F17>VLOOKUP($E17,Data!$A$11:$F$31,4,FALSE),VLOOKUP($E17,Data!$A$11:$F$31,4,FALSE),ROUND(VLOOKUP($E17,Data!$A$11:$F$31,2,FALSE)*$F17,0))))),\"\"))","v":""},null,null,null,null,null,null,{"$f":"IF('Algemene gegevens'!$C15=\"\",\"\",'Algemene gegevens'!$C15)","v":""},{"$f":"IF('Algemene gegevens'!$D15=\"\",\"\",'Algemene gegevens'!$D15)","v":""},null,null,null,null,null,null,null,0,{"$f":"IF($F17=\"\",0,IF(VLOOKUP($E17,Data!$A$11:$F$31,6,FALSE)=1,1,0))","v":0},0,{"$f":"IF($F17=\"\",0,IF(VLOOKUP($E17,Data!$A$11:$F$31,6,FALSE)=2,1,0))","v":0},0,0,0,null,1,1,1,{"$f":"IF(F17=\"\",\"\",IF((VLOOKUP($E17,Data!$A$11:$F$31,6,FALSE)=1),ROUND(VLOOKUP($E17,Data!$A$11:$F$31,5,FALSE),0),IF((VLOOKUP($E17,Data!$A$11:$F$31,6,FALSE)=2),ROUND(VLOOKUP($E17,Data!$A$11:$F$31,5,FALSE),0),\"\")))","v":""},0,0,-1,-1]
[null,null,{"$f":"IF('Algemene gegevens'!C16=\"\",\"\",'Algemene gegevens'!C16)","v":""},{"$f":"IF('Algemene gegevens'!D16=\"\",\"\",'Algemene gegevens'!D16)","v":""},{"$f":"IF('Algemene gegevens'!E16=\"\",\"\",'Algemene gegevens'!E16)","v":""},{"$f":"IF('Algemene gegevens'!F16=\"\",\"\",'Algemene gegevens'!F16)","v":""},{"$f":"IF(E18=\"\",\"\",IF((VLOOKUP(E18,Data!$A$11:$F$31,6,FALSE)=1),IF(E18=\"\",\"\",(IF(VLOOKUP(E18,Data!$A$11:$D$31,2,FALSE)*F18<VLOOKUP(E18,Data!$A$11:$D$31,3,FALSE),ROUND(VLOOKUP(E18,Data!$A$11:$D$31,3,FALSE),0),IF(VLOOKUP(E18,Data!$A$11:$D$31,2,FALSE)*F18>VLOOKUP(E18,Data!$A$11:$D$31,4,FALSE),ROUND(VLOOKUP(E18,Data!$A$11:$D$31,4,FALSE),0),ROUND(VLOOKUP(E18,Data!$A$11:$D$31,2,FALSE)*F18,0))))),\"\"))","v":""},null,null,null,{"$f":"IF(E18=\"\",\"\",IF((VLOOKUP($E18,Data!$A$11:$F$31,6,FALSE)=1),ROUND(VLOOKUP($E18,Data!$A$11:$F$31,5,FALSE),0),\"\"))","v":""},{"$f":"IF(E18=\"\",\"\",IF((VLOOKUP($E18,Data!$A$11:$F$31,6,FALSE)=2),ROUND(VLOOKUP($E18,Data!$A$11:$F$31,5,FALSE),0),\"\"))","v":""},null,{"$f":"IF($E18=\"\",\"\",IF((VLOOKUP($E18,Data!$A$11:$F$31,6,FALSE)=2),IF($E18=\"\",\"\",(IF(VLOOKUP($E18,Data!$A$11:$F$31,2,FALSE)*$F18<VLOOKUP($E18,Data!$A$11:$F$31,3,FALSE),VLOOKUP($E18,Data!$A$11:$F$31,3,FALSE),IF(VLOOKUP($E18,Data!$A$11:$F$31,2,FALSE)*$F18>VLOOKUP($E18,Data!$A$11:$F$31,4,FALSE),VLOOKUP($E18,Data!$A$11:$F$31,4,FALSE),ROUND(VLOOKUP($E18,Data!$A$11:$F$31,2,FALSE)*$F18,0))))),\"\"))","v":""},null,30,null,null,null,null,{"$f":"IF('Algemene gegevens'!$C16=\"\",\"\",'Algemene gegevens'!$C16)","v":""},{"$f":"IF('Algemene gegevens'!$D16=\"\",\"\",'Algemene gegevens'!$D16)","v":""},null,null,null,null,null,null,null,0,{"$f":"IF($F18=\"\",0,IF(VLOOKUP($E18,Data!$A$11:$F$31,6,FALSE)=1,1,0))","v":0},0,{"$f":"IF($F18=\"\",0,IF(VLOOKUP($E18,Data!$A$11:$F$31,6,FALSE)=2,1,0))","v":0},0,0,0,null,1,1,1,{"$f":"IF(F18=\"\",\"\",IF((VLOOKUP($E18,Data!$A$11:$F$31,6,FALSE)=1),ROUND(VLOOKUP($E18,Data!$A$11:$F$31,5,FALSE),0),IF((VLOOKUP($E18,Data!$A$11:$F$31,6,FALSE)=2),ROUND(VLOOKUP($E18,Data!$A$11:$F$31,5,FALSE),0),\"\")))","v":""},0,0,-1,-1]
[null,null,{"$f":"IF('Algemene gegevens'!C17=\"\",\"\",'Algemene gegevens'!C17)","v":""},{"$f":"IF('Algemene gegevens'!D17=\"\",\"\",'Algemene gegevens'!D17)","v":""},{"$f":"IF('Algemene gegevens'!E17=\"\",\"\",'Algemene gegevens'!E17)","v":""},{"$f":"IF('Algemene gegevens'!F17=\"\",\"\",'Algemene gegevens'!F17)","v":""},{"$f":"IF(E19=\"\",\"\",IF((VLOOKUP(E19,Data!$A$11:$F$31,6,FALSE)=1),IF(E19=\"\",\"\",(IF(VLOOKUP(E19,Data!$A$11:$D$31,2,FALSE)*F19<VLOOKUP(E19,Data!$A$11:$D$31,3,FALSE),ROUND(VLOOKUP(E19,Data!$A$11:$D$31,3,FALSE),0),IF(VLOOKUP(E19,Data!$A$11:$D$31,2,FALSE)*F19>VLOOKUP(E19,Data!$A$11:$D$31,4,FALSE),ROUND(VLOOKUP(E19,Data!$A$11:$D$31,4,FALSE),0),ROUND(VLOOKUP(E19,Data!$A$11:$D$31,2,FALSE)*F19,0))))),\"\"))","v":""},null,null,null,{"$f":"IF(E19=\"\",\"\",IF((VLOOKUP($E19,Data!$A$11:$F$31,6,FALSE)=1),ROUND(VLOOKUP($E19,Data!$A$11:$F$31,5,FALSE),0),\"\"))","v":""},{"$f":"IF(E19=\"\",\"\",IF((VLOOKUP($E19,Data!$A$11:$F$31,6,FALSE)=2),ROUND(VLOOKUP($E19,Data!$A$11:$F$31,5,FALSE),0),\"\"))","v":""},null,{"$f":"IF($E19=\"\",\"\",IF((VLOOKUP($E19,Data!$A$11:$F$31,6,FALSE)=2),IF($E19=\"\",\"\",(IF(VLOOKUP($E19,Data!$A$11:$F$31,2,FALSE)*$F19<VLOOKUP($E19,Data!$A$11:$F$31,3,FALSE),VLOOKUP($E19,Data!$A$11:$F$31,3,FALSE),IF(VLOOKUP($E19,Data!$A$11:$F$31,2,FALSE)*$F19>VLOOKUP($E19,Data!$A$11:$F$31,4,FALSE),VLOOKUP($E19,Data!$A$11:$F$31,4,FALSE),ROUND(VLOOKUP($E19,Data!$A$11:$F$31,2,FALSE)*$F19,0))))),\"\"))","v":""},null,50,null,null,null,null,{"$f":"IF('Algemene gegevens'!$C17=\"\",\"\",'Algemene gegevens'!$C17)","v":""},{"$f":"IF('Algemene gegevens'!$D17=\"\",\"\",'Algemene gegevens'!$D17)","v":""},null,null,null,null,null,null,null,0,{"$f":"IF($F19=\"\",0,IF(VLOOKUP($E19,Data!$A$11:$F$31,6,FALSE)=1,1,0))","v":0},0,{"$f":"IF($F19=\"\",0,IF(VLOOKUP($E19,Data!$A$11:$F$31,6,FALSE)=2,1,0))","v":0},0,0,0,null,1,1,1,{"$f":"IF(F19=\"\",\"\",IF((VLOOKUP($E19,Data!$A$11:$F$31,6,FALSE)=1),ROUND(VLOOKUP($E19,Data!$A$11:$F$31,5,FALSE),0),IF((VLOOKUP($E19,Data!$A$11:$F$31,6,FALSE)=2),ROUND(VLOOKUP($E19,Data!$A$11:$F$31,5,FALSE),0),\"\")))","v":""},0,0,-1,-1]
[null,null,{"$f":"IF('Algemene gegevens'!C18=\"\",\"\",'Algemene gegevens'!C18)","v":""},{"$f":"IF('Algemene gegevens'!D18=\"\",\"\",'Algemene gegevens'!D18)","v":""},{"$f":"IF('Algemene gegevens'!E18=\"\",\"\",'Algemene gegevens'!E18)","v":""},{"$f":"IF('Algemene gegevens'!F18=\"\",\"\",'Algemene gegevens'!F18)","v":""},{"$f":"IF(E20=\"\",\"\",IF((VLOOKUP(E20,Data!$A$11:$F$31,6,FALSE)=1),IF(E20=\"\",\"\",(IF(VLOOKUP(E20,Data!$A$11:$D$31,2,FALSE)*F20<VLOOKUP(E20,Data!$A$11:$D$31,3,FALSE),ROUND(VLOOKUP(E20,Data!$A$11:$D$31,3,FALSE),0),IF(VLOOKUP(E20,Data!$A$11:$D$31,2,FALSE)*F20>VLOOKUP(E20,Data!$A$11:$D$31,4,FALSE),ROUND(VLOOKUP(E20,Data!$A$11:$D$31,4,FALSE),0),ROUND(VLOOKUP(E20,Data!$A$11:$D$31,2,FALSE)*F20,0))))),\"\"))","v":""},null,null,60,{"$f":"IF(E20=\"\",\"\",IF((VLOOKUP($E20,Data!$A$11:$F$31,6,FALSE)=1),ROUND(VLOOKUP($E20,Data!$A$11:$F$31,5,FALSE),0),\"\"))","v":""},{"$f":"IF(E20=\"\",\"\",IF((VLOOKUP($E20,Data!$A$11:$F$31,6,FALSE)=2),ROUND(VLOOKUP($E20,Data!$A$11:$F$31,5,FALSE),0),\"\"))","v":""},null,{"$f":"IF($E20=\"\",\"\",IF((VLOOKUP($E20,Data!$A$11:$F$31,6,FALSE)=2),IF($E20=\"\",\"\",(IF(VLOOKUP($E20,Data!$A$11:$F$31,2,FALSE)*$F20<VLOOKUP($E20,Data!$A$11:$F$31,3,FALSE),VLOOKUP($E20,Data!$A$11:$F$31,3,FALSE),IF(VLOOKUP($E20,Data!$A$11:$F$31,2,FALSE)*$F20>VLOOKUP($E20,Data!$A$11:$F$31,4,FALSE),VLOOKUP($E20,Data!$A$11:$F$31,4,FALSE),ROUND(VLOOKUP($E20,Data!$A$11:$F$31,2,FALSE)*$F20,0))))),\"\"))","v":""},null,null,null,null,null,null,{"$f":"IF('Algemene gegevens'!$C18=\"\",\"\",'Algemene gegevens'!$C18)","v":""},{"$f":"IF('Algemene gegevens'!$D18=\"\",\"\",'Algemene gegevens'!$D18)","v":""},null,null,null,null,null,null,null,0,{"$f":"IF($F20=\"\",0,IF(VLOOKUP($E20,Data!$A$11:$F$31,6,FALSE)=1,1,0))","v":0},0,{"$f":"IF($F20=\"\",0,IF(VLOOKUP($E20,Data!$A$11:$F$31,6,FALSE)=2,1,0))","v":0},0,0,0,null,1,1,1,{"$f":"IF(F20=\"\",\"\",IF((VLOOKUP($E20,Data!$A$11:$F$31,6,FALSE)=1),ROUND(VLOOKUP($E20,Data!$A$11:$F$31,5,FALSE),0),IF((VLOOKUP($E20,Data!$A$11:$F$31,6,FALSE)=2),ROUND(VLOOKUP($E20,Data!$A$11:$F$31,5,FALSE),0),\"\")))","v":""},0,0,-1,-1]
[null,null,{"$f":"IF('Algemene gegevens'!C19=\"\",\"\",'Algemene gegevens'!C19)","v":""},{"$f":"IF('Algemene gegevens'!D19=\"\",\"\",'Algemene gegevens'!D19)","v":""},{"$f":"IF('Algemene gegevens'!E19=\"\",\"\",'Algemene gegevens'!E19)","v":""},{"$f":"IF('Algemene gegevens'!F19=\"\",\"\",'Algemene gegevens'!F19)","v":""},{"$f":"IF(E21=\"\",\"\",IF((VLOOKUP(E21,Data!$A$11:$F$31,6,FALSE)=1),IF(E21=\"\",\"\",(IF(VLOOKUP(E21,Data!$A$11:$D$31,2,FALSE)*F21<VLOOKUP(E21,Data!$A$11:$D$31,3,FALSE),ROUND(VLOOKUP(E21,Data!$A$11:$D$31,3,FALSE),0),IF(VLOOKUP(E21,Data!$A$11:$D$31,2,FALSE)*F21>VLOOKUP(E21,Data!$A$11:$D$31,4,FALSE),ROUND(VLOOKUP(E21,Data!$A$11:$D$31,4,FALSE),0),ROUND(VLOOKUP(E21,Data!$A$11:$D$31,2,FALSE)*F21,0))))),\"\"))","v":""},null,null,null,{"$f":"IF(E21=\"\",\"\",IF((VLOOKUP($E21,Data!$A$11:$F$31,6,FALSE)=1),ROUND(VLOOKUP($E21,Data!$A$11:$F$31,5,FALSE),0),\"\"))","v":""},{"$f":"IF(E21=\"\",\"\",IF((VLOOKUP($E21,Data!$A$11:$F$31,6,FALSE)=2),ROUND(VLOOKUP($E21,Data!$A$11:$F$31,5,FALSE),0),\"\"))","v":""},null,{"$f":"IF($E21=\"\",\"\",IF((VLOOKUP($E21,Data!$A$11:$F$31,6,FALSE)=2),IF($E21=\"\",\"\",(IF(VLOOKUP($E21,Data!$A$11:$F$31,2,FALSE)*$F21<VLOOKUP($E21,Data!$A$11:$F$31,3,FALSE),VLOOKUP($E21,Data!$A$11:$F$31,3,FALSE),IF(VLOOKUP($E21,Data!$A$11:$F$31,2,FALSE)*$F21>VLOOKUP($E21,Data!$A$11:$F$31,4,FALSE),VLOOKUP($E21,Data!$A$11:$F$31,4,FALSE),ROUND(VLOOKUP($E21,Data!$A$11:$F$31,2,FALSE)*$F21,0))))),\"\"))","v":""},null,null,null,null,null,null,{"$f":"IF('Algemene gegevens'!$C19=\"\",\"\",'Algemene gegevens'!$C19)","v":""},{"$f":"IF('Algemene gegevens'!$D19=\"\",\"\",'Algemene gegevens'!$D19)","v":""},null,null,null,null,null,null,null,0,{"$f":"IF($F21=\"\",0,IF(VLOOKUP($E21,Data!$A$11:$F$31,6,FALSE)=1,1,0))","v":0},0,{"$f":"IF($F21=\"\",0,IF(VLOOKUP($E21,Data!$A$11:$F$31,6,FALSE)=2,1,0))","v":0},0,0,0,null,1,1,1,{"$f":"IF(F21=\"\",\"\",IF((VLOOKUP($E21,Data!$A$11:$F$31,6,FALSE)=1),ROUND(VLOOKUP($E21,Data!$A$11:$F$31,5,FALSE),0),IF((VLOOKUP($E21,Data!$A$11:$F$31,6,FALSE)=2),ROUND(VLOOKUP($E21,Data!$A$11:$F$31,5,FALSE),0),\"\")))","v":""},0,0,-1,-1]
[null,null,{"$f":"IF('Algemene gegevens'!C20=\"\",\"\",'Algemene gegevens'!C20)","v":""},{"$f":"IF('Algemene gegevens'!D20=\"\",\"\",'Algemene gegevens'!D20)","v":""},{"$f":"IF('Algemene gegevens'!E20=\"\",\"\",'Algemene gegevens'!E20)","v":""},{"$f":"IF('Algemene gegevens'!F20=\"\",\"\",'Algemene gegevens'!F20)","v":""},{"$f":"IF(E22=\"\",\"\",IF((VLOOKUP(E22,Data!$A$11:$F$31,6,FALSE)=1),IF(E22=\"\",\"\",(IF(VLOOKUP(E22,Data!$A$11:$D$31,2,FALSE)*F22<VLOOKUP(E22,Data!$A$11:$D$31,3,FALSE),ROUND(VLOOKUP(E22,Data!$A$11:$D$31,3,FALSE),0),IF(VLOOKUP(E22,Data!$A$11:$D$31,2,FALSE)*F22>VLOOKUP(E22,Data!$A$11:$D$31,4,FALSE),ROUND(VLOOKUP(E22,Data!$A$11:$D$31,4,FALSE),0),ROUND(VLOOKUP(E22,Data!$A$11:$D$31,2,FALSE)*F22,0))))),\"\"))","v":""},null,null,55,{"$f":"IF(E22=\"\",\"\",IF((VLOOKUP($E22,Data!$A$11:$F$31,6,FALSE)=1),ROUND(VLOOKUP($E22,Data!$A$11:$F$31,5,FALSE),0),\"\"))","v":""},{"$f":"IF(E22=\"\",\"\",IF((VLOOKUP($E22,Data!$A$11:$F$31,6,FALSE)=2),ROUND(VLOOKUP($E22,Data!$A$11:$F$31,5,FALSE),0),\"\"))","v":""},null,{"$f":"IF($E22=\"\",\"\",IF((VLOOKUP($E22,Data!$A$11:$F$31,6,FALSE)=2),IF($E22=\"\",\"\",(IF(VLOOKUP($E22,Data!$A$11:$F$31,2,FALSE)*$F22<VLOOKUP($E22,Data!$A$11:$F$31,3,FALSE),VLOOKUP($E22,Data!$A$11:$F$31,3,FALSE),IF(VLOOKUP($E22,Data!$A$11:$F$31,2,FALSE)*$F22>VLOOKUP($E22,Data!$A$11:$F$31,4,FALSE),VLOOKUP($E22,Data!$A$11:$F$31,4,FALSE),ROUND(VLOOKUP($E22,Data!$A$11:$F$31,2,FALSE)*$F22,0))))),\"\"))","v":""},null,null,null,null,null,null,{"$f":"IF('Algemene gegevens'!$C20=\"\",\"\",'Algemene gegevens'!$C20)","v":""},{"$f":"IF('Algemene gegevens'!$D20=\"\",\"\",'Algemene gegevens'!$D20)","v":""},null,null,null,null,null,null,null,0,{"$f":"IF($F22=\"\",0,IF(VLOOKUP($E22,Data!$A$11:$F$31,6,FALSE)=1,1,0))","v":0},0,{"$f":"IF($F22=\"\",0,IF(VLOOKUP($E22,Data!$A$11:$F$31,6,FALSE)=2,1,0))","v":0},0,0,0,null,1,1,1,{"$f":"IF(F22=\"\",\"\",IF((VLOOKUP($E22,Data!$A$11:$F$31,6,FALSE)=1),ROUND(VLOOKUP($E22,Data!$A$11:$F$31,5,FALSE),0),IF((VLOOKUP($E22,Data!$A$11:$F$31,6,FALSE)=2),ROUND(VLOOKUP($E22,Data!$A$11:$F$31,5,FALSE),0),\"\")))","v":""},0,0,-1,-1]
[null,null,{"$f":"IF('Algemene gegevens'!C21=\"\",\"\",'Algemene gegevens'!C21)","v":""},{"$f":"IF('Algemene gegevens'!D21=\"\",\"\",'Algemene gegevens'!D21)","v":""},{"$f":"IF('Algemene gegevens'!E21=\"\",\"\",'Algemene gegevens'!E21)","v":""},{"$f":"IF('Algemene gegevens'!F21=\"\",\"\",'Algemene gegevens'!F21)","v":""},{"$f":"IF(E23=\"\",\"\",IF((VLOOKUP(E23,Data!$A$11:$F$31,6,FALSE)=1),IF(E23=\"\",\"\",(IF(VLOOKUP(E23,Data!$A$11:$D$31,2,FALSE)*F23<VLOOKUP(E23,Data!$A$11:$D$31,3,FALSE),ROUND(VLOOKUP(E23,Data!$A$11:$D$31,3,FALSE),0),IF(VLOOKUP(E23,Data!$A$11:$D$31,2,FALSE)*F23>VLOOKUP(E23,Data!$A$11:$D$31,4,FALSE),ROUND(VLOOKUP(E23,Data!$A$11:$D$31,4,FALSE),0),ROUND(VLOOKUP(E23,Data!$A$11:$D$31,2,FALSE)*F23,0))))),\"\"))","v":""},null,null,57,{"$f":"IF(E23=\"\",\"\",IF((VLOOKUP($E23,Data!$A$11:$F$31,6,FALSE)=1),ROUND(VLOOKUP($E23,Data!$A$11:$F$31,5,FALSE),0),\"\"))","v":""},{"$f":"IF(E23=\"\",\"\",IF((VLOOKUP($E23,Data!$A$11:$F$31,6,FALSE)=2),ROUND(VLOOKUP($E23,Data!$A$11:$F$31,5,FALSE),0),\"\"))","v":""},null,{"$f":"IF($E23=\"\",\"\",IF((VLOOKUP($E23,Data!$A$11:$F$31,6,FALSE)=2),IF($E23=\"\",\"\",(IF(VLOOKUP($E23,Data!$A$11:$F$31,2,FALSE)*$F23<VLOOKUP($E23,Data!$A$11:$F$31,3,FALSE),VLOOKUP($E23,Data!$A$11:$F$31,3,FALSE),IF(VLOOKUP($E23,Data!$A$11:$F$31,2,FALSE)*$F23>VLOOKUP($E23,Data!$A$11:$F$31,4,FALSE),VLOOKUP($E23,Data!$A$11:$F$31,4,FALSE),ROUND(VLOOKUP($E23,Data!$A$11:$F$31,2,FALSE)*$F23,0))))),\"\"))","v":""},null,null,null,null,null,null,{"$f":"IF('Algemene gegevens'!$C21=\"\",\"\",'Algemene gegevens'!$C21)","v":""},{"$f":"IF('Algemene gegevens'!$D21=\"\",\"\",'Algemene gegevens'!$D21)","v":""},null,null,null,null,null,null,null,0,{"$f":"IF($F23=\"\",0,IF(VLOOKUP($E23,Data!$A$11:$F$31,6,FALSE)=1,1,0))","v":0},0,{"$f":"IF($F23=\"\",0,IF(VLOOKUP($E23,Data!$A$11:$F$31,6,FALSE)=2,1,0))","v":0},0,0,0,null,1,1,1,{"$f":"IF(F23=\"\",\"\",IF((VLOOKUP($E23,Data!$A$11:$F$31,6,FALSE)=1),ROUND(VLOOKUP($E23,Data!$A$11:$F$31,5,FALSE),0),IF((VLOOKUP($E23,Data!$A$11:$F$31,6,FALSE)=2),ROUND(VLOOKUP($E23,Data!$A$11:$F$31,5,FALSE),0),\"\")))","v":""},0,0,-1,-1]
[null,null,{"$f":"IF('Algemene gegevens'!C22=\"\",\"\",'Algemene gegevens'!C22)","v":""},{"$f":"IF('Algemene gegevens'!D22=\"\",\"\",'Algemene gegevens'!D22)","v":""},{"$f":"IF('Algemene gegevens'!E22=\"\",\"\",'Algemene gegevens'!E22)","v":""},{"$f":"IF('Algemene gegevens'!F22=\"\",\"\",'Algemene gegevens'!F22)","v":""},{"$f":"IF(E24=\"\",\"\",IF((VLOOKUP(E24,Data!$A$11:$F$31,6,FALSE)=1),IF(E24=\"\",\"\",(IF(VLOOKUP(E24,Data!$A$11:$D$31,2,FALSE)*F24<VLOOKUP(E24,Data!$A$11:$D$31,3,FALSE),ROUND(VLOOKUP(E24,Data!$A$11:$D$31,3,FALSE),0),IF(VLOOKUP(E24,Data!$A$11:$D$31,2,FALSE)*F24>VLOOKUP(E24,Data!$A$11:$D$31,4,FALSE),ROUND(VLOOKUP(E24,Data!$A$11:$D$31,4,FALSE),0),ROUND(VLOOKUP(E24,Data!$A$11:$D$31,2,FALSE)*F24,0))))),\"\"))","v":""},null,null,null,{"$f":"IF(E24=\"\",\"\",IF((VLOOKUP($E24,Data!$A$11:$F$31,6,FALSE)=1),ROUND(VLOOKUP($E24,Data!$A$11:$F$31,5,FALSE),0),\"\"))","v":""},{"$f":"IF(E24=\"\",\"\",IF((VLOOKUP($E24,Data!$A$11:$F$31,6,FALSE)=2),ROUND(VLOOKUP($E24,Data!$A$11:$F$31,5,FALSE),0),\"\"))","v":""},null,{"$f":"IF($E24=\"\",\"\",IF((VLOOKUP($E24,Data!$A$11:$F$31,6,FALSE)=2),IF($E24=\"\",\"\",(IF(VLOOKUP($E24,Data!$A$11:$F$31,2,FALSE)*$F24<VLOOKUP($E24,Data!$A$11:$F$31,3,FALSE),VLOOKUP($E24,Data!$A$11:$F$31,3,FALSE),IF(VLOOKUP($E24,Data!$A$11:$F$31,2,FALSE)*$F24>VLOOKUP($E24,Data!$A$11:$F$31,4,FALSE),VLOOKUP($E24,Data!$A$11:$F$31,4,FALSE),ROUND(VLOOKUP($E24,Data!$A$11:$F$31,2,FALSE)*$F24,0))))),\"\"))","v":""},null,null,null,null,null,null,{"$f":"IF('Algemene gegevens'!$C22=\"\",\"\",'Algemene gegevens'!$C22)","v":""},{"$f":"IF('Algemene gegevens'!$D22=\"\",\"\",'Algemene gegevens'!$D22)","v":""},null,null,null,null,null,null,null,0,{"$f":"IF($F24=\"\",0,IF(VLOOKUP($E24,Data!$A$11:$F$31,6,FALSE)=1,1,0))","v":0},0,{"$f":"IF($F24=\"\",0,IF(VLOOKUP($E24,Data!$A$11:$F$31,6,FALSE)=2,1,0))","v":0},0,0,0,null,1,1,1,{"$f":"IF(F24=\"\",\"\",IF((VLOOKUP($E24,Data!$A$11:$F$31,6,FALSE)=1),ROUND(VLOOKUP($E24,Data!$A$11:$F$31,5,FALSE),0),IF((VLOOKUP($E24,Data!$A$11:$F$31,6,FALSE)=2),ROUND(VLOOKUP($E24,Data!$A$11:$F$31,5,FALSE),0),\"\")))","v":""},0,0,-1,-1]
[null,null,{"$f":"IF('Algemene gegevens'!C23=\"\",\"\",'Algemene gegevens'!C23)","v":""},{"$f":"IF('Algemene gegevens'!D23=\"\",\"\",'Algemene gegevens'!D23)","v":""},{"$f":"IF('Algemene gegevens'!E23=\"\",\"\",'Algemene gegevens'!E23)","v":""},{"$f":"IF('Algemene gegevens'!F23=\"\",\"\",'Algemene gegevens'!F23)","v":""},{"$f":"IF(E25=\"\",\"\",IF((VLOOKUP(E25,Data!$A$11:$F$31,6,FALSE)=1),IF(E25=\"\",\"\",(IF(VLOOKUP(E25,Data!$A$11:$D$31,2,FALSE)*F25<VLOOKUP(E25,Data!$A$11:$D$31,3,FALSE),ROUND(VLOOKUP(E25,Data!$A$11:$D$31,3,FALSE),0),IF(VLOOKUP(E25,Data!$A$11:$D$31,2,FALSE)*F25>VLOOKUP(E25,Data!$A$11:$D$31,4,FALSE),ROUND(VLOOKUP(E25,Data!$A$11:$D$31,4,FALSE),0),ROUND(VLOOKUP(E25,Data!$A$11:$D$31,2,FALSE)*F25,0))))),\"\"))","v":""},null,null,null,{"$f":"IF(E25=\"\",\"\",IF((VLOOKUP($E25,Data!$A$11:$F$31,6,FALSE)=1),ROUND(VLOOKUP($E25,Data!$A$11:$F$31,5,FALSE),0),\"\"))","v":""},{"$f":"IF(E25=\"\",\"\",IF((VLOOKUP($E25,Data!$A$11:$F$31,6,FALSE)=2),ROUND(VLOOKUP($E25,Data!$A$11:$F$31,5,FALSE),0),\"\"))","v":""},null,{"$f":"IF($E25=\"\",\"\",IF((VLOOKUP($E25,Data!$A$11:$F$31,6,FALSE)=2),IF($E25=\"\",\"\",(IF(VLOOKUP($E25,Data!$A$11:$F$31,2,FALSE)*$F25<VLOOKUP($E25,Data!$A$11:$F$31,3,FALSE),VLOOKUP($E25,Data!$A$11:$F$31,3,FALSE),IF(VLOOKUP($E25,Data!$A$11:$F$31,2,FALSE)*$F25>VLOOKUP($E25,Data!$A$11:$F$31,4,FALSE),VLOOKUP($E25,Data!$A$11:$F$31,4,FALSE),ROUND(VLOOKUP($E25,Data!$A$11:$F$31,2,FALSE)*$F25,0))))),\"\"))","v":""},null,60,null,null,null,null,{"$f":"IF('Algemene gegevens'!$C23=\"\",\"\",'Algemene gegevens'!$C23)","v":""},{"$f":"IF('Algemene gegevens'!$D23=\"\",\"\",'Algemene gegevens'!$D23)","v":""},null,null,null,null,null,null,null,0,{"$f":"IF($F25=\"\",0,IF(VLOOKUP($E25,Data!$A$11:$F$31,6,FALSE)=1,1,0))","v":0},0,{"$f":"IF($F25=\"\",0,IF(VLOOKUP($E25,Data!$A$11:$F$31,6,FALSE)=2,1,0))","v":0},0,0,0,null,1,1,1,{"$f":"IF(F25=\"\",\"\",IF((VLOOKUP($E25,Data!$A$11:$F$31,6,FALSE)=1),ROUND(VLOOKUP($E25,Data!$A$11:$F$31,5,FALSE),0),IF((VLOOKUP($E25,Data!$A$11:$F$31,6,FALSE)=2),ROUND(VLOOKUP($E25,Data!$A$11:$F$31,5,FALSE),0),\"\")))","v":""},0,0,-1,-1]
[null,null,{"$f":"IF('Algemene gegevens'!C24=\"\",\"\",'Algemene gegevens'!C24)","v":""},{"$f":"IF('Algemene gegevens'!D24=\"\",\"\",'Algemene gegevens'!D24)","v":""},{"$f":"IF('Algemene gegevens'!E24=\"\",\"\",'Algemene gegevens'!E24)","v":""},{"$f":"IF('Algemene gegevens'!F24=\"\",\"\",'Algemene gegevens'!F24)","v":""},{"$f":"IF(E26=\"\",\"\",IF((VLOOKUP(E26,Data!$A$11:$F$31,6,FALSE)=1),IF(E26=\"\",\"\",(IF(VLOOKUP(E26,Data!$A$11:$D$31,2,FALSE)*F26<VLOOKUP(E26,Data!$A$11:$D$31,3,FALSE),ROUND(VLOOKUP(E26,Data!$A$11:$D$31,3,FALSE),0),IF(VLOOKUP(E26,Data!$A$11:$D$31,2,FALSE)*F26>VLOOKUP(E26,Data!$A$11:$D$31,4,FALSE),ROUND(VLOOKUP(E26,Data!$A$11:$D$31,4,FALSE),0),ROUND(VLOOKUP(E26,Data!$A$11:$D$31,2,FALSE)*F26,0))))),\"\"))","v":""},null,null,null,{"$f":"IF(E26=\"\",\"\",IF((VLOOKUP($E26,Data!$A$11:$F$31,6,FALSE)=1),ROUND(VLOOKUP($E26,Data!$A$11:$F$31,5,FALSE),0),\"\"))","v":""},{"$f":"IF(E26=\"\",\"\",IF((VLOOKUP($E26,Data!$A$11:$F$31,6,FALSE)=2),ROUND(VLOOKUP($E26,Data!$A$11:$F$31,5,FALSE),0),\"\"))","v":""},null,{"$f":"IF($E26=\"\",\"\",IF((VLOOKUP($E26,Data!$A$11:$F$31,6,FALSE)=2),IF($E26=\"\",\"\",(IF(VLOOKUP($E26,Data!$A$11:$F$31,2,FALSE)*$F26<VLOOKUP($E26,Data!$A$11:$F$31,3,FALSE),VLOOKUP($E26,Data!$A$11:$F$31,3,FALSE),IF(VLOOKUP($E26,Data!$A$11:$F$31,2,FALSE)*$F26>VLOOKUP($E26,Data!$A$11:$F$31,4,FALSE),VLOOKUP($E26,Data!$A$11:$F$31,4,FALSE),ROUND(VLOOKUP($E26,Data!$A$11:$F$31,2,FALSE)*$F26,0))))),\"\"))","v":""},null,26,null,null,null,null,{"$f":"IF('Algemene gegevens'!$C24=\"\",\"\",'Algemene gegevens'!$C24)","v":""},{"$f":"IF('Algemene gegevens'!$D24=\"\",\"\",'Algemene gegevens'!$D24)","v":""},null,null,null,null,null,null,null,0,{"$f":"IF($F26=\"\",0,IF(VLOOKUP($E26,Data!$A$11:$F$31,6,FALSE)=1,1,0))","v":0},0,{"$f":"IF($F26=\"\",0,IF(VLOOKUP($E26,Data!$A$11:$F$31,6,FALSE)=2,1,0))","v":0},0,0,0,null,1,1,1,{"$f":"IF(F26=\"\",\"\",IF((VLOOKUP($E26,Data!$A$11:$F$31,6,FALSE)=1),ROUND(VLOOKUP($E26,Data!$A$11:$F$31,5,FALSE),0),IF((VLOOKUP($E26,Data!$A$11:$F$31,6,FALSE)=2),ROUND(VLOOKUP($E26,Data!$A$11:$F$31,5,FALSE),0),\"\")))","v":""},0,0,-1,-1]
[null,null,{"$f":"IF('Algemene gegevens'!C25=\"\",\"\",'Algemene gegevens'!C25)","v":""},{"$f":"IF('Algemene gegevens'!D25=\"\",\"\",'Algemene gegevens'!D25)","v":""},{"$f":"IF('Algemene gegevens'!E25=\"\",\"\",'Algemene gegevens'!E25)","v":""},{"$f":"IF('Algemene gegevens'!F25=\"\",\"\",'Algemene gegevens'!F25)","v":""},{"$f":"IF(E27=\"\",\"\",IF((VLOOKUP(E27,Data!$A$11:$F$31,6,FALSE)=1),IF(E27=\"\",\"\",(IF(VLOOKUP(E27,Data!$A$11:$D$31,2,FALSE)*F27<VLOOKUP(E27,Data!$A$11:$D$31,3,FALSE),ROUND(VLOOKUP(E27,Data!$A$11:$D$31,3,FALSE),0),IF(VLOOKUP(E27,Data!$A$11:$D$31,2,FALSE)*F27>VLOOKUP(E27,Data!$A$11:$D$31,4,FALSE),ROUND(VLOOKUP(E27,Data!$A$11:$D$31,4,FALSE),0),ROUND(VLOOKUP(E27,Data!$A$11:$D$31,2,FALSE)*F27,0))))),\"\"))","v":""},null,null,null,{"$f":"IF(E27=\"\",\"\",IF((VLOOKUP($E27,Data!$A$11:$F$31,6,FALSE)=1),ROUND(VLOOKUP($E27,Data!$A$11:$F$31,5,FALSE),0),\"\"))","v":""},{"$f":"IF(E27=\"\",\"\",IF((VLOOKUP($E27,Data!$A$11:$F$31,6,FALSE)=2),ROUND(VLOOKUP($E27,Data!$A$11:$F$31,5,FALSE),0),\"\"))","v":""},null,{"$f":"IF($E27=\"\",\"\",IF((VLOOKUP($E27,Data!$A$11:$F$31,6,FALSE)=2),IF($E27=\"\",\"\",(IF(VLOOKUP($E27,Data!$A$11:$F$31,2,FALSE)*$F27<VLOOKUP($E27,Data!$A$11:$F$31,3,FALSE),VLOOKUP($E27,Data!$A$11:$F$31,3,FALSE),IF(VLOOKUP($E27,Data!$A$11:$F$31,2,FALSE)*$F27>VLOOKUP($E27,Data!$A$11:$F$31,4,FALSE),VLOOKUP($E27,Data!$A$11:$F$31,4,FALSE),ROUND(VLOOKUP($E27,Data!$A$11:$F$31,2,FALSE)*$F27,0))))),\"\"))","v":""},null,null,null,null,null,null,{"$f":"IF('Algemene gegevens'!$C25=\"\",\"\",'Algemene gegevens'!$C25)","v":""},{"$f":"IF('Algemene gegevens'!$D25=\"\",\"\",'Algemene gegevens'!$D25)","v":""},null,null,null,null,null,null,null,0,{"$f":"IF($F27=\"\",0,IF(VLOOKUP($E27,Data!$A$11:$F$31,6,FALSE)=1,1,0))","v":0},0,{"$f":"IF($F27=\"\",0,IF(VLOOKUP($E27,Data!$A$11:$F$31,6,FALSE)=2,1,0))","v":0},0,0,0,null,1,1,1,{"$f":"IF(F27=\"\",\"\",IF((VLOOKUP($E27,Data!$A$11:$F$31,6,FALSE)=1),ROUND(VLOOKUP($E27,Data!$A$11:$F$31,5,FALSE),0),IF((VLOOKUP($E27,Data!$A$11:$F$31,6,FALSE)=2),ROUND(VLOOKUP($E27,Data!$A$11:$F$31,5,FALSE),0),\"\")))","v":""},0,0,-1,-1]
[null,null,{"$f":"IF('Algemene gegevens'!C26=\"\",\"\",'Algemene gegevens'!C26)","v":""},{"$f":"IF('Algemene gegevens'!D26=\"\",\"\",'Algemene gegevens'!D26)","v":""},{"$f":"IF('Algemene gegevens'!E26=\"\",\"\",'Algemene gegevens'!E26)","v":""},{"$f":"IF('Algemene gegevens'!F26=\"\",\"\",'Algemene gegevens'!F26)","v":""},{"$f":"IF(E28=\"\",\"\",IF((VLOOKUP(E28,Data!$A$11:$F$31,6,FALSE)=1),IF(E28=\"\",\"\",(IF(VLOOKUP(E28,Data!$A$11:$D$31,2,FALSE)*F28<VLOOKUP(E28,Data!$A$11:$D$31,3,FALSE),ROUND(VLOOKUP(E28,Data!$A$11:$D$31,3,FALSE),0),IF(VLOOKUP(E28,Data!$A$11:$D$31,2,FALSE)*F28>VLOOKUP(E28,Data!$A$11:$D$31,4,FALSE),ROUND(VLOOKUP(E28,Data!$A$11:$D$31,4,FALSE),0),ROUND(VLOOKUP(E28,Data!$A$11:$D$31,2,FALSE)*F28,0))))),\"\"))","v":""},null,null,null,{"$f":"IF(E28=\"\",\"\",IF((VLOOKUP($E28,Data!$A$11:$F$31,6,FALSE)=1),ROUND(VLOOKUP($E28,Data!$A$11:$F$31,5,FALSE),0),\"\"))","v":""},{"$f":"IF(E28=\"\",\"\",IF((VLOOKUP($E28,Data!$A$11:$F$31,6,FALSE)=2),ROUND(VLOOKUP($E28,Data!$A$11:$F$31,5,FALSE),0),\"\"))","v":""},null,{"$f":"IF($E28=\"\",\"\",IF((VLOOKUP($E28,Data!$A$11:$F$31,6,FALSE)=2),IF($E28=\"\",\"\",(IF(VLOOKUP($E28,Data!$A$11:$F$31,2,FALSE)*$F28<VLOOKUP($E28,Data!$A$11:$F$31,3,FALSE),VLOOKUP($E28,Data!$A$11:$F$31,3,FALSE),IF(VLOOKUP($E28,Data!$A$11:$F$31,2,FALSE)*$F28>VLOOKUP($E28,Data!$A$11:$F$31,4,FALSE),VLOOKUP($E28,Data!$A$11:$F$31,4,FALSE),ROUND(VLOOKUP($E28,Data!$A$11:$F$31,2,FALSE)*$F28,0))))),\"\"))","v":""},null,null,null,null,null,null,{"$f":"IF('Algemene gegevens'!$C26=\"\",\"\",'Algemene gegevens'!$C26)","v":""},{"$f":"IF('Algemene gegevens'!$D26=\"\",\"\",'Algemene gegevens'!$D26)","v":""},null,null,null,null,null,null,null,0,{"$f":"IF($F28=\"\",0,IF(VLOOKUP($E28,Data!$A$11:$F$31,6,FALSE)=1,1,0))","v":0},0,{"$f":"IF($F28=\"\",0,IF(VLOOKUP($E28,Data!$A$11:$F$31,6,FALSE)=2,1,0))","v":0},0,0,0,null,1,1,1,{"$f":"IF(F28=\"\",\"\",IF((VLOOKUP($E28,Data!$A$11:$F$31,6,FALSE)=1),ROUND(VLOOKUP($E28,Data!$A$11:$F$31,5,FALSE),0),IF((VLOOKUP($E28,Data!$A$11:$F$31,6,FALSE)=2),ROUND(VLOOKUP($E28,Data!$A$11:$F$31,5,FALSE),0),\"\")))","v":""},0,0,-1,-1]
[null,null,{"$f":"IF('Algemene gegevens'!C27=\"\",\"\",'Algemene gegevens'!C27)","v":""},{"$f":"IF('Algemene gegevens'!D27=\"\",\"\",'Algemene gegevens'!D27)","v":""},{"$f":"IF('Algemene gegevens'!E27=\"\",\"\",'Algemene gegevens'!E27)","v":""},{"$f":"IF('Algemene gegevens'!F27=\"\",\"\",'Algemene gegevens'!F27)","v":""},{"$f":"IF(E29=\"\",\"\",IF((VLOOKUP(E29,Data!$A$11:$F$31,6,FALSE)=1),IF(E29=\"\",\"\",(IF(VLOOKUP(E29,Data!$A$11:$D$31,2,FALSE)*F29<VLOOKUP(E29,Data!$A$11:$D$31,3,FALSE),ROUND(VLOOKUP(E29,Data!$A$11:$D$31,3,FALSE),0),IF(VLOOKUP(E29,Data!$A$11:$D$31,2,FALSE)*F29>VLOOKUP(E29,Data!$A$11:$D$31,4,FALSE),ROUND(VLOOKUP(E29,Data!$A$11:$D$31,4,FALSE),0),ROUND(VLOOKUP(E29,Data!$A$11:$D$31,2,FALSE)*F29,0))))),\"\"))","v":""},null,null,null,{"$f":"IF(E29=\"\",\"\",IF((VLOOKUP($E29,Data!$A$11:$F$31,6,FALSE)=1),ROUND(VLOOKUP($E29,Data!$A$11:$F$31,5,FALSE),0),\"\"))","v":""},{"$f":"IF(E29=\"\",\"\",IF((VLOOKUP($E29,Data!$A$11:$F$31,6,FALSE)=2),ROUND(VLOOKUP($E29,Data!$A$11:$F$31,5,FALSE),0),\"\"))","v":""},null,{"$f":"IF($E29=\"\",\"\",IF((VLOOKUP($E29,Data!$A$11:$F$31,6,FALSE)=2),IF($E29=\"\",\"\",(IF(VLOOKUP($E29,Data!$A$11:$F$31,2,FALSE)*$F29<VLOOKUP($E29,Data!$A$11:$F$31,3,FALSE),VLOOKUP($E29,Data!$A$11:$F$31,3,FALSE),IF(VLOOKUP($E29,Data!$A$11:$F$31,2,FALSE)*$F29>VLOOKUP($E29,Data!$A$11:$F$31,4,FALSE),VLOOKUP($E29,Data!$A$11:$F$31,4,FALSE),ROUND(VLOOKUP($E29,Data!$A$11:$F$31,2,FALSE)*$F29,0))))),\"\"))","v":""},null,null,null,null,null,null,{"$f":"IF('Algemene gegevens'!$C27=\"\",\"\",'Algemene gegevens'!$C27)","v":""},{"$f":"IF('Algemene gegevens'!$D27=\"\",\"\",'Algemene gegevens'!$D27)","v":""},null,null,null,null,null,null,null,0,{"$f":"IF($F29=\"\",0,IF(VLOOKUP($E29,Data!$A$11:$F$31,6,FALSE)=1,1,0))","v":0},0,{"$f":"IF($F29=\"\",0,IF(VLOOKUP($E29,Data!$A$11:$F$31,6,FALSE)=2,1,0))","v":0},0,0,0,null,1,1,1,{"$f":"IF(F29=\"\",\"\",IF((VLOOKUP($E29,Data!$A$11:$F$31,6,FALSE)=1),ROUND(VLOOKUP($E29,Data!$A$11:$F$31,5,FALSE),0),IF((VLOOKUP($E29,Data!$A$11:$F$31,6,FALSE)=2),ROUND(VLOOKUP($E29,Data!$A$11:$F$31,5,FALSE),0),\"\")))","v":""},0,0,-1,-1]
[null,null,{"$f":"IF('Algemene gegevens'!C28=\"\",\"\",'Algemene gegevens'!C28)","v":""},{"$f":"IF('Algemene gegevens'!D28=\"\",\"\",'Algemene gegevens'!D28)","v":""},{"$f":"IF('Algemene gegevens'!E28=\"\",\"\",'Algemene gegevens'!E28)","v":""},{"$f":"IF('Algemene gegevens'!F28=\"\",\"\",'Algemene gegevens'!F28)","v":""},{"$f":"IF(E30=\"\",\"\",IF((VLOOKUP(E30,Data!$A$11:$F$31,6,FALSE)=1),IF(E30=\"\",\"\",(IF(VLOOKUP(E30,Data!$A$11:$D$31,2,FALSE)*F30<VLOOKUP(E30,Data!$A$11:$D$31,3,FALSE),ROUND(VLOOKUP(E30,Data!$A$11:$D$31,3,FALSE),0),IF(VLOOKUP(E30,Data!$A$11:$D$31,2,FALSE)*F30>VLOOKUP(E30,Data!$A$11:$D$31,4,FALSE),ROUND(VLOOKUP(E30,Data!$A$11:$D$31,4,FALSE),0),ROUND(VLOOKUP(E30,Data!$A$11:$D$31,2,FALSE)*F30,0))))),\"\"))","v":""},null,null,null,{"$f":"IF(E30=\"\",\"\",IF((VLOOKUP($E30,Data!$A$11:$F$31,6,FALSE)=1),ROUND(VLOOKUP($E30,Data!$A$11:$F$31,5,FALSE),0),\"\"))","v":""},{"$f":"IF(E30=\"\",\"\",IF((VLOOKUP($E30,Data!$A$11:$F$31,6,FALSE)=2),ROUND(VLOOKUP($E30,Data!$A$11:$F$31,5,FALSE),0),\"\"))","v":""},null,{"$f":"IF($E30=\"\",\"\",IF((VLOOKUP($E30,Data!$A$11:$F$31,6,FALSE)=2),IF($E30=\"\",\"\",(IF(VLOOKUP($E30,Data!$A$11:$F$31,2,FALSE)*$F30<VLOOKUP($E30,Data!$A$11:$F$31,3,FALSE),VLOOKUP($E30,Data!$A$11:$F$31,3,FALSE),IF(VLOOKUP($E30,Data!$A$11:$F$31,2,FALSE)*$F30>VLOOKUP($E30,Data!$A$11:$F$31,4,FALSE),VLOOKUP($E30,Data!$A$11:$F$31,4,FALSE),ROUND(VLOOKUP($E30,Data!$A$11:$F$31,2,FALSE)*$F30,0))))),\"\"))","v":""},null,null,null,null,null,null,{"$f":"IF('Algemene gegevens'!$C28=\"\",\"\",'Algemene gegevens'!$C28)","v":""},{"$f":"IF('Algemene gegevens'!$D28=\"\",\"\",'Algemene gegevens'!$D28)","v":""},null,null,null,null,null,null,null,0,{"$f":"IF($F30=\"\",0,IF(VLOOKUP($E30,Data!$A$11:$F$31,6,FALSE)=1,1,0))","v":0},0,{"$f":"IF($F30=\"\",0,IF(VLOOKUP($E30,Data!$A$11:$F$31,6,FALSE)=2,1,0))","v":0},0,0,0,null,1,1,1,{"$f":"IF(F30=\"\",\"\",IF((VLOOKUP($E30,Data!$A$11:$F$31,6,FALSE)=1),ROUND(VLOOKUP($E30,Data!$A$11:$F$31,5,FALSE),0),IF((VLOOKUP($E30,Data!$A$11:$F$31,6,FALSE)=2),ROUND(VLOOKUP($E30,Data!$A$11:$F$31,5,FALSE),0),\"\")))","v":""},0,0,-1,-1]
[null,null,{"$f":"IF('Algemene gegevens'!C29=\"\",\"\",'Algemene gegevens'!C29)","v":""},{"$f":"IF('Algemene gegevens'!D29=\"\",\"\",'Algemene gegevens'!D29)","v":""},{"$f":"IF('Algemene gegevens'!E29=\"\",\"\",'Algemene gegevens'!E29)","v":""},{"$f":"IF('Algemene gegevens'!F29=\"\",\"\",'Algemene gegevens'!F29)","v":""},{"$f":"IF(E31=\"\",\"\",IF((VLOOKUP(E31,Data!$A$11:$F$31,6,FALSE)=1),IF(E31=\"\",\"\",(IF(VLOOKUP(E31,Data!$A$11:$D$31,2,FALSE)*F31<VLOOKUP(E31,Data!$A$11:$D$31,3,FALSE),ROUND(VLOOKUP(E31,Data!$A$11:$D$31,3,FALSE),0),IF(VLOOKUP(E31,Data!$A$11:$D$31,2,FALSE)*F31>VLOOKUP(E31,Data!$A$11:$D$31,4,FALSE),ROUND(VLOOKUP(E31,Data!$A$11:$D$31,4,FALSE),0),ROUND(VLOOKUP(E31,Data!$A$11:$D$31,2,FALSE)*F31,0))))),\"\"))","v":""},null,null,null,{"$f":"IF(E31=\"\",\"\",IF((VLOOKUP($E31,Data!$A$11:$F$31,6,FALSE)=1),ROUND(VLOOKUP($E31,Data!$A$11:$F$31,5,FALSE),0),\"\"))","v":""},{"$f":"IF(E31=\"\",\"\",IF((VLOOKUP($E31,Data!$A$11:$F$31,6,FALSE)=2),ROUND(VLOOKUP($E31,Data!$A$11:$F$31,5,FALSE),0),\"\"))","v":""},null,{"$f":"IF($E31=\"\",\"\",IF((VLOOKUP($E31,Data!$A$11:$F$31,6,FALSE)=2),IF($E31=\"\",\"\",(IF(VLOOKUP($E31,Data!$A$11:$F$31,2,FALSE)*$F31<VLOOKUP($E31,Data!$A$11:$F$31,3,FALSE),VLOOKUP($E31,Data!$A$11:$F$31,3,FALSE),IF(VLOOKUP($E31,Data!$A$11:$F$31,2,FALSE)*$F31>VLOOKUP($E31,Data!$A$11:$F$31,4,FALSE),VLOOKUP($E31,Data!$A$11:$F$31,4,FALSE),ROUND(VLOOKUP($E31,Data!$A$11:$F$31,2,FALSE)*$F31,0))))),\"\"))","v":""},null,null,null,null,null,null,{"$f":"IF('Algemene gegevens'!$C29=\"\",\"\",'Algemene gegevens'!$C29)","v":""},{"$f":"IF('Algemene gegevens'!$D29=\"\",\"\",'Algemene gegevens'!$D29)","v":""},null,null,null,null,null,null,null,0,{"$f":"IF($F31=\"\",0,IF(VLOOKUP($E31,Data!$A$11:$F$31,6,FALSE)=1,1,0))","v":0},0,{"$f":"IF($F31=\"\",0,IF(VLOOKUP($E31,Data!$A$11:$F$31,6,FALSE)=2,1,0))","v":0},0,0,0,null,1,1,1,{"$f":"IF(F31=\"\",\"\",IF((VLOOKUP($E31,Data!$A$11:$F$31,6,FALSE)=1),ROUND(VLOOKUP($E31,Data!$A$11:$F$31,5,FALSE),0),IF((VLOOKUP($E31,Data!$A$11:$F$31,6,FALSE)=2),ROUND(VLOOKUP($E31,Data!$A$11:$F$31,5,FALSE),0),\"\")))","v":""},0,0,-1,-1]
[null,null,{"$f":"IF('Algemene gegevens'!C30=\"\",\"\",'Algemene gegevens'!C30)","v":""},{"$f":"IF('Algemene gegevens'!D30=\"\",\"\",'Algemene gegevens'!D30)","v":""},{"$f":"IF('Algemene gegevens'!E30=\"\",\"\",'Algemene gegevens'!E30)","v":""},{"$f":"IF('Algemene gegevens'!F30=\"\",\"\",'Algemene gegevens'!F30)","v":""},{"$f":"IF(E32=\"\",\"\",IF((VLOOKUP(E32,Data!$A$11:$F$31,6,FALSE)=1),IF(E32=\"\",\"\",(IF(VLOOKUP(E32,Data!$A$11:$D$31,2,FALSE)*F32<VLOOKUP(E32,Data!$A$11:$D$31,3,FALSE),ROUND(VLOOKUP(E32,Data!$A$11:$D$31,3,FALSE),0),IF(VLOOKUP(E32,Data!$A$11:$D$31,2,FALSE)*F32>VLOOKUP(E32,Data!$A$11:$D$31,4,FALSE),ROUND(VLOOKUP(E32,Data!$A$11:$D$31,4,FALSE),0),ROUND(VLOOKUP(E32,Data!$A$11:$D$31,2,FALSE)*F32,0))))),\"\"))","v":""},null,null,null,{"$f":"IF(E32=\"\",\"\",IF((VLOOKUP($E32,Data!$A$11:$F$31,6,FALSE)=1),ROUND(VLOOKUP($E32,Data!$A$11:$F$31,5,FALSE),0),\"\"))","v":""},{"$f":"IF(E32=\"\",\"\",IF((VLOOKUP($E32,Data!$A$11:$F$31,6,FALSE)=2),ROUND(VLOOKUP($E32,Data!$A$11:$F$31,5,FALSE),0),\"\"))","v":""},null,{"$f":"IF($E32=\"\",\"\",IF((VLOOKUP($E32,Data!$A$11:$F$31,6,FALSE)=2),IF($E32=\"\",\"\",(IF(VLOOKUP($E32,Data!$A$11:$F$31,2,FALSE)*$F32<VLOOKUP($E32,Data!$A$11:$F$31,3,FALSE),VLOOKUP($E32,Data!$A$11:$F$31,3,FALSE),IF(VLOOKUP($E32,Data!$A$11:$F$31,2,FALSE)*$F32>VLOOKUP($E32,Data!$A$11:$F$31,4,FALSE),VLOOKUP($E32,Data!$A$11:$F$31,4,FALSE),ROUND(VLOOKUP($E32,Data!$A$11:$F$31,2,FALSE)*$F32,0))))),\"\"))","v":""},null,null,null,null,null,null,{"$f":"IF('Algemene gegevens'!$C30=\"\",\"\",'Algemene gegevens'!$C30)","v":""},{"$f":"IF('Algemene gegevens'!$D30=\"\",\"\",'Algemene gegevens'!$D30)","v":""},null,null,null,null,null,null,null,0,{"$f":"IF($F32=\"\",0,IF(VLOOKUP($E32,Data!$A$11:$F$31,6,FALSE)=1,1,0))","v":0},0,{"$f":"IF($F32=\"\",0,IF(VLOOKUP($E32,Data!$A$11:$F$31,6,FALSE)=2,1,0))","v":0},0,0,0,null,1,1,1,{"$f":"IF(F32=\"\",\"\",IF((VLOOKUP($E32,Data!$A$11:$F$31,6,FALSE)=1),ROUND(VLOOKUP($E32,Data!$A$11:$F$31,5,FALSE),0),IF((VLOOKUP($E32,Data!$A$11:$F$31,6,FALSE)=2),ROUND(VLOOKUP($E32,Data!$A$11:$F$31,5,FALSE),0),\"\")))","v":""},0,0,-1,-1]
[null,null,{"$f":"IF('Algemene gegevens'!C31=\"\",\"\",'Algemene gegevens'!C31)","v":""},{"$f":"IF('Algemene gegevens'!D31=\"\",\"\",'Algemene gegevens'!D31)","v":""},{"$f":"IF('Algemene gegevens'!E31=\"\",\"\",'Algemene gegevens'!E31)","v":""},{"$f":"IF('Algemene gegevens'!F31=\"\",\"\",'Algemene gegevens'!F31)","v":""},{"$f":"IF(E33=\"\",\"\",IF((VLOOKUP(E33,Data!$A$11:$F$31,6,FALSE)=1),IF(E33=\"\",\"\",(IF(VLOOKUP(E33,Data!$A$11:$D$31,2,FALSE)*F33<VLOOKUP(E33,Data!$A$11:$D$31,3,FALSE),ROUND(VLOOKUP(E33,Data!$A$11:$D$31,3,FALSE),0),IF(VLOOKUP(E33,Data!$A$11:$D$31,2,FALSE)*F33>VLOOKUP(E33,Data!$A$11:$D$31,4,FALSE),ROUND(VLOOKUP(E33,Data!$A$11:$D$31,4,FALSE),0),ROUND(VLOOKUP(E33,Data!$A$11:$D$31,2,FALSE)*F33,0))))),\"\"))","v":""},null,null,null,{"$f":"IF(E33=\"\",\"\",IF((VLOOKUP($E33,Data!$A$11:$F$31,6,FALSE)=1),ROUND(VLOOKUP($E33,Data!$A$11:$F$31,5,FALSE),0),\"\"))","v":""},{"$f":"IF(E33=\"\",\"\",IF((VLOOKUP($E33,Data!$A$11:$F$31,6,FALSE)=2),ROUND(VLOOKUP($E33,Data!$A$11:$F$31,5,FALSE),0),\"\"))","v":""},null,{"$f":"IF($E33=\"\",\"\",IF((VLOOKUP($E33,Data!$A$11:$F$31,6,FALSE)=2),IF($E33=\"\",\"\",(IF(VLOOKUP($E33,Data!$A$11:$F$31,2,FALSE)*$F33<VLOOKUP($E33,Data!$A$11:$F$31,3,FALSE),VLOOKUP($E33,Data!$A$11:$F$31,3,FALSE),IF(VLOOKUP($E33,Data!$A$11:$F$31,2,FALSE)*$F33>VLOOKUP($E33,Data!$A$11:$F$31,4,FALSE),VLOOKUP($E33,Data!$A$11:$F$31,4,FALSE),ROUND(VLOOKUP($E33,Data!$A$11:$F$31,2,FALSE)*$F33,0))))),\"\"))","v":""},null,null,null,null,null,null,{"$f":"IF('Algemene gegevens'!$C31=\"\",\"\",'Algemene gegevens'!$C31)","v":""},{"$f":"IF('Algemene gegevens'!$D31=\"\",\"\",'Algemene gegevens'!$D31)","v":""},null,null,null,null,null,null,null,0,{"$f":"IF($F33=\"\",0,IF(VLOOKUP($E33,Data!$A$11:$F$31,6,FALSE)=1,1,0))","v":0},0,{"$f":"IF($F33=\"\",0,IF(VLOOKUP($E33,Data!$A$11:$F$31,6,FALSE)=2,1,0))","v":0},0,0,0,null,1,1,1,{"$f":"IF(F33=\"\",\"\",IF((VLOOKUP($E33,Data!$A$11:$F$31,6,FALSE)=1),ROUND(VLOOKUP($E33,Data!$A$11:$F$31,5,FALSE),0),IF((VLOOKUP($E33,Data!$A$11:$F$31,6,FALSE)=2),ROUND(VLOOKUP($E33,Data!$A$11:$F$31,5,FALSE),0),\"\")))","v":""},0,0,-1,-1]
[null,null,{"$f":"IF('Algemene gegevens'!C32=\"\",\"\",'Algemene gegevens'!C32)","v":""},{"$f":"IF('Algemene gegevens'!D32=\"\",\"\",'Algemene gegevens'!D32)","v":""},{"$f":"IF('Algemene gegevens'!E32=\"\",\"\",'Algemene gegevens'!E32)","v":""},{"$f":"IF('Algemene gegevens'!F32=\"\",\"\",'Algemene gegevens'!F32)","v":""},{"$f":"IF(E34=\"\",\"\",IF((VLOOKUP(E34,Data!$A$11:$F$31,6,FALSE)=1),IF(E34=\"\",\"\",(IF(VLOOKUP(E34,Data!$A$11:$D$31,2,FALSE)*F34<VLOOKUP(E34,Data!$A$11:$D$31,3,FALSE),ROUND(VLOOKUP(E34,Data!$A$11:$D$31,3,FALSE),0),IF(VLOOKUP(E34,Data!$A$11:$D$31,2,FALSE)*F34>VLOOKUP(E34,Data!$A$11:$D$31,4,FALSE),ROUND(VLOOKUP(E34,Data!$A$11:$D$31,4,FALSE),0),ROUND(VLOOKUP(E34,Data!$A$11:$D$31,2,FALSE)*F34,0))))),\"\"))","v":""},null,null,null,{"$f":"IF(E34=\"\",\"\",IF((VLOOKUP($E34,Data!$A$11:$F$31,6,FALSE)=1),ROUND(VLOOKUP($E34,Data!$A$11:$F$31,5,FALSE),0),\"\"))","v":""},{"$f":"IF(E34=\"\",\"\",IF((VLOOKUP($E34,Data!$A$11:$F$31,6,FALSE)=2),ROUND(VLOOKUP($E34,Data!$A$11:$F$31,5,FALSE),0),\"\"))","v":""},null,{"$f":"IF($E34=\"\",\"\",IF((VLOOKUP($E34,Data!$A$11:$F$31,6,FALSE)=2),IF($E34=\"\",\"\",(IF(VLOOKUP($E34,Data!$A$11:$F$31,2,FALSE)*$F34<VLOOKUP($E34,Data!$A$11:$F$31,3,FALSE),VLOOKUP($E34,Data!$A$11:$F$31,3,FALSE),IF(VLOOKUP($E34,Data!$A$11:$F$31,2,FALSE)*$F34>VLOOKUP($E34,Data!$A$11:$F$31,4,FALSE),VLOOKUP($E34,Data!$A$11:$F$31,4,FALSE),ROUND(VLOOKUP($E34,Data!$A$11:$F$31,2,FALSE)*$F34,0))))),\"\"))","v":""},null,null,null,null,null,null,{"$f":"IF('Algemene gegevens'!$C32=\"\",\"\",'Algemene gegevens'!$C32)","v":""},{"$f":"IF('Algemene gegevens'!$D32=\"\",\"\",'Algemene gegevens'!$D32)","v":""},null,null,null,null,null,null,null,0,{"$f":"IF($F34=\"\",0,IF(VLOOKUP($E34,Data!$A$11:$F$31,6,FALSE)=1,1,0))","v":0},0,{"$f":"IF($F34=\"\",0,IF(VLOOKUP($E34,Data!$A$11:$F$31,6,FALSE)=2,1,0))","v":0},0,0,0,"1=OK",1,1,1,{"$f":"IF(F34=\"\",\"\",IF((VLOOKUP($E34,Data!$A$11:$F$31,6,FALSE)=1),ROUND(VLOOKUP($E34,Data!$A$11:$F$31,5,FALSE),0),IF((VLOOKUP($E34,Data!$A$11:$F$31,6,FALSE)=2),ROUND(VLOOKUP($E34,Data!$A$11:$F$31,5,FALSE),0),\"\")))","v":""},0,0,-1,-1]
[null,null,null,null,null,"totalen",{"$f":"SUM(G14:G34)","v":0},{"$f":"SUMPRODUCT(H14:H34,AI14:AI34)","v":0},{"$f":"SUMPRODUCT(I14:I34,AD14:AD34)","v":0},{"$f":"IF(J9=\"ja\",SUMPRODUCT(J14:J34,AF14:AF34),\"\")","v":0},null,null,null,{"$f":"SUM(N14:N34)","v":0},{"$f":"SUMPRODUCT(O14:O34,AD14:AD34)","v":0},{"$f":"IF(P9=\"ja\",SUMPRODUCT(P14:P34,AH14:AH34),\"\")","v":0},null,null,null,null,null,null,null,null,null,null,null,null,null,null,null,null,null,null,null,{"$f":"SUM(AJ14:AJ34)","v":0},{"$f":"I35/O35","v":{"$error":"#DIV/0!"}},{"$f":"IF(SUM(H35:I35)>=G35,1,0)","v":1},{"$f":"MIN(AM14:AM34)","v":1},{"$f":"MIN(AN14:AN34)","v":1},null,{"$f":"MAX(AP14:AP34)","v":0},{"$f":"MAX(AQ14:AQ34)","v":0},{"$f":"MAX(AR14:AR34)","v":-1},{"$f":"MAX(AS14:AS34)","v":-1}]
[null,null,null,null,null,null,null,null,null,{"$f":"SUMPRODUCT(AE14:AE34,J14:J34)","v":0},"Balans",null,null,null,null,{"$f":"SUMPRODUCT(AG14:AG34,P14:P34)","v":0},null,null,null,null,null,null,null,null,null,null,null,null,null,null,null,null,null,null,null,null,{"$f":"IF(AK35>(1+(Data!B78/100)),0,IF(AK35<(1+(Data!B77/100)),0,1))","v":{"$error":"#DIV/0!"}}]
[]
[]
[]
[]
[null,null,"Lekdebieten kanalen"]
[null,null,null,null,null,null,null,null,null,null,null,null,null,null,null,"(m³/h)"]
[null,null,null,null,null,"Lekdebiet toevoerkanalen",null,null,null,null,null,null,null,null,"lekdebietsmeting?","ja"]
[null,null,null,null,null,null,null,null,null,null,null,null,null,null,null,null,null,null,null,null,null,null,null,null,null,null,null,null,null,null,null,null,null,null,null,null,null,null,null,null,"druk na de ventilator (Pa)",null,null,null,"hoort tot stavingsstuk"]
[null,null,null,null,null,null,null,null,null,null,null,null,null,null,"ontstenteniswaarde",{"$f":"IF($AG$4=\"A\",\"geen\",IF($AG$4=\"B\",0.18*G35,IF($AG$4=\"C\",\"geen\",0.18*G35)))","v":0}]
[null,null,null,null,null,null,null,null,null,null,null,null,null,null,"maximaal gewenste waarde"]
[null,null,null,null,null,null,null,null,null,null,null,null,null,null,"gemeten:"]
[]
[null,null,null,null,null,"Lekdebiet afvoerkanalen",null,null,null,null,null,null,null,null,"lekdebietsmeting?","ja"]
[null,null,null,null,null,null,null,null,null,null,null,null,null,null,null,null,null,null,null,null,null,null,null,null,null,null,null,null,null,null,null,null,null,null,null,null,null,null,null,null,"druk voor de ventilator (Pa)",null,null,null,"hoort tot stavingsstuk"]
[null,null,null,null,null,null,null,null,null,null,null,null,null,null,"ontstenteniswaarde",{"$f":"0.18*N35","v":0}]
[null,null,null,null,null,null,null,null,null,null,null,null,null,null,"maximaal gewenste waarde"]
[null,null,null,null,null,null,null,null,null,null,null,null,null,null,"gemeten:"]
[]
[null,null,null,null,null,null,null,null,null,null,null,null,null,null,null,null,null,null,null,null,null,null,null,null,null,null,null,null,null,null,null,null,null,null,null,null,null,null,null,null,null,null,null,null,"D"]
[null,null,"VERMENIGVULDIGINGSFACTOR m:",null,null,null,null,null,null,null,null,null,null,null,null,{"$f":"AS56","v":1.5},null,null,null,null,null,null,null,null,null,null,null,null,null,null,null,null,null,null,null,null,null,null,null,null,null,null,null,null,{"$f":"1+0.5*(MAX(IF(J9=\"ja\",IF(AR35=0,0,IF(AR35=1,MAX(0,MIN(0.2,IF(G35=0,0,J36/G35-1.2))),0.2)),0.2)*IF(G35=0,1,G35)+IF(P43=\"nee\",0.18,IF(P47=\"\",0.18,MIN(0.18,IF(G35=0,0,P47/G35))))*IF(G35=0,1,G35),IF(P9=\"ja\",IF(AS35=0,0,IF(AS35=1,MAX(0,MIN(0.2,IF(N35=0,0,P36/N35-1.2))),0.2)),0.2)*IF(N35=0,1,N35)+IF(P49=\"nee\",0.18,IF(P53=\"\",0.18,MIN(0.18,IF(N35=0,0,P53/N35))))*IF(N35=0,1,N35))/IF(OR(G35=0,N35=0),1,MAX(G35,N35)))/0.38","v":1.5}]
[null,null,"De vermenigvuldigingsfactor werd berekend volgens bijlage B.1 van bijlage I bij het EPB-besluit. "]
[]
[null,"VOORVERWARMING",null,null,null,null,null,null,null,null,null,null,null,null,null,null,null,null,null,null,"KEUZE WTW / VOORVERWARMING"]
[]
[null,null,null,"warmterecuperatie voorzien",null,null,null,null,"ja"]
[null,null,null,null,null,null,null,null,null,null,null,null,null,null,null,null,null,null,null,null,"Specificaties","Gegevens"]
[null,null,null,"automatische debietsregeling - maximaal 5 % afwijking",null,null,null,null,"ja"]
[null,null,null,null,null,null,null,null,null,null,null,null,null,null,null,null,null,null,null,null,"Naam"]
[null,null,null,"minimaal rendement volgens NBN EN 308 bij ",null,null,null,null,null,null,null,null,null,null,null,null,null,null,null,null,"Merk"]
[null,null,null,null,"een minimaal toevoerdebiet van :",null,null,null,{"$f":"MAX(IF(H9=\"nee\",G35,G35-H35),I35,IF(AND(J9=\"ja\",P43=\"ja\"),J35+P47,0))","v":0},"(m³/h)",null,null,null,null,null,null,null,null,null,null,"Product-ID"]
[null,null,null,null,"een minimaal afvoerdebiet van : ",null,null,null,{"$f":"MAX(N35,O35,IF(AND(P49=\"ja\",P9=\"ja\"),P35+P53,0))","v":0},"(m³/h)",null,null,null,null,null,null,null,null,null,null,"Thermisch rendement (EN 308)"]
[]
[null,null,null,"zomer bypass",null,null,"onvolledige zomerbypass"]
[]
[null,"HULPENERGIE VENTILATOREN",null,null,null,null,null,null,null,null,null,null,null,null,null,null,null,null,null,null,"VENTILATORKEUZE"]
[]
[null,null,"type ventilatoren",null,"gelijkstroomventilator (DC)"]
[null,null,null,null,null,"som ","toevoer","afvoer","recirculatie",null,null,null,null,null,null,null,null,null,null,null,"Specificaties",null,"Gegevens"]
[null,null,"nominaal motorvermogen",null,null,{"$f":"+G75+H75+I75","v":0},null,null,null,"(W)",null,null,null,null,null,null,null,null,null,null,null,null,"Toevoer","Recirculatie","Afvoer"]
[null,null,"maximaal vermogen",null,null,{"$f":"+G76+H76+I76","v":0},null,null,null,"(W)"]
[null,null,"vermogen bij werkingspunt",null,null,{"$f":"+G77+H77+I77","v":0},null,null,null,"(W)",null,null,null,null,null,null,null,null,null,null,"Benaming"]
[null,null,null,null,null,null,null,null,null,null,null,null,null,null,null,null,null,null,null,null,"Product-ID"]
[null,null,null,null,null,null,null,null,null,null,null,null,null,null,null,null,null,null,null,null,"Motortype"]
[null,null,null,null,null,null,null,null,null,null,null,null,null,null,null,null,null,null,null,null,"Vermogen:"]
[null,null,null,null,null,null,null,null,null,null,null,null,null,null,null,null,null,null,null,null,"     nominaal motorvermogen"]
[null,null,null,null,null,null,null,null,null,null,null,null,null,null,null,null,null,null,null,null,"     maximaal vermogen"]
[null,null,null,null,null,null,null,null,null,null,null,null,null,null,null,null,null,null,null,null,"     vermogen bij werkingspunt (grafiek)"]

{"sheet":"BCD-inregeling","index":6,"n_rows":39,"n_cols":24,"rows_kept":39,"cut":false,"hidden":false,"merged":[[11,12,11,15],[11,16,11,19],[11,20,11,23],[3,4,3,7],[10,6,10,15],[11,6,11,7],[11,8,11,11]]}
[]
[null,null,"Inregeling van debieten"]
[]
[null,null,"Ventilatiesysteem",null,"D: mechanische toevoer, mechanische afvoer "]
[]
[null,null,"Werkwijze"]
[]
[null,null,"recirculatie afzonderlijk eerst doen"]
[]
[]
[]
[null,null,null,null,null,null,"ontwerp",null,"startmeting",null,null,null,"eerste regeling",null,null,null,"tweede regeling",null,null,null,"eindmeting"]
[null,null,"Naam","Code","Soort ruimte","Opp","toevoer","afvoer","toevoer","%","afvoer","%","toevoer","%","afvoer","%","toevoer","%","afvoer","%","toevoer","%","afvoer","%"]
[]
[null,null,"Ventilator toevoer",null,null,null,null,null,85,null,null,null,80,null,null,null,80,null,null,null,80]
[null,null,"Ventilator afvoer",null,null,null,null,null,null,null,75,null,null,null,85,null,null,null,85,null,null,null,85]
[null,null,null,null,null,"(m²)"]
[null,null,{"$f":"IF('Algemene gegevens'!C12=\"\",\"\",'Algemene gegevens'!C12)","v":""},{"$f":"IF('Algemene gegevens'!D12=\"\",\"\",'Algemene gegevens'!D12)","v":""},{"$f":"IF('Algemene gegevens'!E12=\"\",\"\",'Algemene gegevens'!E12)","v":""},{"$f":"IF('Algemene gegevens'!F12=\"\",\"\",'Algemene gegevens'!F12)","v":""},{"$f":"D!$I14","v":0},{"$f":"D!$O14","v":0},0,{"$f":"IF($G18=0,\"nvt\",I18/$G18*100)","v":"nvt"},85,{"$f":"IF($H18=0,\"nvt\",K18/$H18*100)","v":"nvt"},0,{"$f":"IF($G18=0,\"nvt\",M18/$G18*100)","v":"nvt"},85,{"$f":"IF($H18=0,\"nvt\",O18/$H18*100)","v":"nvt"},0,{"$f":"IF($G18=0,\"nvt\",Q18/$G18*100)","v":"nvt"},85,{"$f":"IF($H18=0,\"nvt\",S18/$H18*100)","v":"nvt"},0,{"$f":"IF($G18=0,\"nvt\",U18/$G18*100)","v":"nvt"},85,{"$f":"IF($H18=0,\"nvt\",W18/$H18*100)","v":"nvt"}]
[null,null,{"$f":"IF('Algemene gegevens'!C13=\"\",\"\",'Algemene gegevens'!C13)","v":""},{"$f":"IF('Algemene gegevens'!D13=\"\",\"\",'Algemene gegevens'!D13)","v":""},{"$f":"IF('Algemene gegevens'!E13=\"\",\"\",'Algemene gegevens'!E13)","v":""},{"$f":"IF('Algemene gegevens'!F13=\"\",\"\",'Algemene gegevens'!F13)","v":""},{"$f":"D!$I15","v":0},{"$f":"D!$O15","v":0},75,{"$f":"IF($G19=0,\"nvt\",I19/$G19*100)","v":"nvt"},0,{"$f":"IF($H19=0,\"nvt\",K19/$H19*100)","v":"nvt"},0,{"$f":"IF($G19=0,\"nvt\",M19/$G19*100)","v":"nvt"},0,{"$f":"IF($H19=0,\"nvt\",O19/$H19*100)","v":"nvt"},0,{"$f":"IF($G19=0,\"nvt\",Q19/$G19*100)","v":"nvt"},0,{"$f":"IF($H19=0,\"nvt\",S19/$H19*100)","v":"nvt"},0,{"$f":"IF($G19=0,\"nvt\",U19/$G19*100)","v":"nvt"},0,{"$f":"IF($H19=0,\"nvt\",W19/$H19*100)","v":"nvt"}]
[null,null,{"$f":"IF('Algemene gegevens'!C14=\"\",\"\",'Algemene gegevens'!C14)","v":""},{"$f":"IF('Algemene gegevens'!D14=\"\",\"\",'Algemene gegevens'!D14)","v":""},{"$f":"IF('Algemene gegevens'!E14=\"\",\"\",'Algemene gegevens'!E14)","v":""},{"$f":"IF('Algemene gegevens'!F14=\"\",\"\",'Algemene gegevens'!F14)","v":""},{"$f":"D!$I16","v":0},{"$f":"D!$O16","v":0},60,"nvt",0,"nvt",0,"nvt",0,"nvt",0,"nvt",0,"nvt",0,"nvt",0,"nvt"]
[null,null,{"$f":"IF('Algemene gegevens'!C15=\"\",\"\",'Algemene gegevens'!C15)","v":""},{"$f":"IF('Algemene gegevens'!D15=\"\",\"\",'Algemene gegevens'!D15)","v":""},{"$f":"IF('Algemene gegevens'!E15=\"\",\"\",'Algemene gegevens'!E15)","v":""},{"$f":"IF('Algemene gegevens'!F15=\"\",\"\",'Algemene gegevens'!F15)","v":""},{"$f":"D!$I17","v":0},{"$f":"D!$O17","v":0},0,"nvt",0,"nvt",0,"nvt",0,"nvt",0,"nvt",0,"nvt",0,"nvt",0,"nvt"]
[null,null,{"$f":"IF('Algemene gegevens'!C16=\"\",\"\",'Algemene gegevens'!C16)","v":""},{"$f":"IF('Algemene gegevens'!D16=\"\",\"\",'Algemene gegevens'!D16)","v":""},{"$f":"IF('Algemene gegevens'!E16=\"\",\"\",'Algemene gegevens'!E16)","v":""},{"$f":"IF('Algemene gegevens'!F16=\"\",\"\",'Algemene gegevens'!F16)","v":""},{"$f":"D!$I18","v":0},{"$f":"D!$O18","v":0},0,"nvt",35,"nvt",0,"nvt",0,"nvt",0,"nvt",0,"nvt",0,"nvt",0,"nvt"]
[null,null,{"$f":"IF('Algemene gegevens'!C17=\"\",\"\",'Algemene gegevens'!C17)","v":""},{"$f":"IF('Algemene gegevens'!D17=\"\",\"\",'Algemene gegevens'!D17)","v":""},{"$f":"IF('Algemene gegevens'!E17=\"\",\"\",'Algemene gegevens'!E17)","v":""},{"$f":"IF('Algemene gegevens'!F17=\"\",\"\",'Algemene gegevens'!F17)","v":""},{"$f":"D!$I19","v":0},{"$f":"D!$O19","v":0},0,"nvt",70,"nvt",0,"nvt",0,"nvt",0,"nvt",0,"nvt",0,"nvt",0,"nvt"]
[null,null,{"$f":"IF('Algemene gegevens'!C18=\"\",\"\",'Algemene gegevens'!C18)","v":""},{"$f":"IF('Algemene gegevens'!D18=\"\",\"\",'Algemene gegevens'!D18)","v":""},{"$f":"IF('Algemene gegevens'!E18=\"\",\"\",'Algemene gegevens'!E18)","v":""},{"$f":"IF('Algemene gegevens'!F18=\"\",\"\",'Algemene gegevens'!F18)","v":""},{"$f":"D!$I20","v":0},{"$f":"D!$O20","v":0},60,"nvt",0,"nvt",0,"nvt",0,"nvt",0,"nvt",0,"nvt",0,"nvt",0,"nvt"]
[null,null,{"$f":"IF('Algemene gegevens'!C19=\"\",\"\",'Algemene gegevens'!C19)","v":""},{"$f":"IF('Algemene gegevens'!D19=\"\",\"\",'Algemene gegevens'!D19)","v":""},{"$f":"IF('Algemene gegevens'!E19=\"\",\"\",'Algemene gegevens'!E19)","v":""},{"$f":"IF('Algemene gegevens'!F19=\"\",\"\",'Algemene gegevens'!F19)","v":""},{"$f":"D!$I21","v":0},{"$f":"D!$O21","v":0},0,"nvt",0,"nvt",0,"nvt",0,"nvt",0,"nvt",0,"nvt",0,"nvt",0,"nvt"]
[null,null,{"$f":"IF('Algemene gegevens'!C20=\"\",\"\",'Algemene gegevens'!C20)","v":""},{"$f":"IF('Algemene gegevens'!D20=\"\",\"\",'Algemene gegevens'!D20)","v":""},{"$f":"IF('Algemene gegevens'!E20=\"\",\"\",'Algemene gegevens'!E20)","v":""},{"$f":"IF('Algemene gegevens'!F20=\"\",\"\",'Algemene gegevens'!F20)","v":""},{"$f":"D!$I22","v":0},{"$f":"D!$O22","v":0},65,"nvt",0,"nvt",0,"nvt",0,"nvt",0,"nvt",0,"nvt",0,"nvt",0,"nvt"]
[null,null,{"$f":"IF('Algemene gegevens'!C21=\"\",\"\",'Algemene gegevens'!C21)","v":""},{"$f":"IF('Algemene gegevens'!D21=\"\",\"\",'Algemene gegevens'!D21)","v":""},{"$f":"IF('Algemene gegevens'!E21=\"\",\"\",'Algemene gegevens'!E21)","v":""},{"$f":"IF('Algemene gegevens'!F21=\"\",\"\",'Algemene gegevens'!F21)","v":""},{"$f":"D!$I23","v":0},{"$f":"D!$O23","v":0},68,"nvt",0,"nvt",0,"nvt",0,"nvt",0,"nvt",0,"nvt",0,"nvt",0,"nvt"]
[null,null,{"$f":"IF('Algemene gegevens'!C22=\"\",\"\",'Algemene gegevens'!C22)","v":""},{"$f":"IF('Algemene gegevens'!D22=\"\",\"\",'Algemene gegevens'!D22)","v":""},{"$f":"IF('Algemene gegevens'!E22=\"\",\"\",'Algemene gegevens'!E22)","v":""},{"$f":"IF('Algemene gegevens'!F22=\"\",\"\",'Algemene gegevens'!F22)","v":""},{"$f":"D!$I24","v":0},{"$f":"D!$O24","v":0},0,"nvt",0,"nvt",0,"nvt",0,"nvt",0,"nvt",0,"nvt",0,"nvt",0,"nvt"]
[null,null,{"$f":"IF('Algemene gegevens'!C23=\"\",\"\",'Algemene gegevens'!C23)","v":""},{"$f":"IF('Algemene gegevens'!D23=\"\",\"\",'Algemene gegevens'!D23)","v":""},{"$f":"IF('Algemene gegevens'!E23=\"\",\"\",'Algemene gegevens'!E23)","v":""},{"$f":"IF('Algemene gegevens'!F23=\"\",\"\",'Algemene gegevens'!F23)","v":""},{"$f":"D!$I25","v":0},{"$f":"D!$O25","v":0},0,"nvt",70,"nvt",0,"nvt",0,"nvt",0,"nvt",0,"nvt",0,"nvt",0,"nvt"]
[null,null,{"$f":"IF('Algemene gegevens'!C24=\"\",\"\",'Algemene gegevens'!C24)","v":""},{"$f":"IF('Algemene gegevens'!D24=\"\",\"\",'Algemene gegevens'!D24)","v":""},{"$f":"IF('Algemene gegevens'!E24=\"\",\"\",'Algemene gegevens'!E24)","v":""},{"$f":"IF('Algemene gegevens'!F24=\"\",\"\",'Algemene gegevens'!F24)","v":""},{"$f":"D!$I26","v":0},{"$f":"D!$O26","v":0},0,"nvt",20,"nvt",0,"nvt",0,"nvt",0,"nvt",0,"nvt",0,"nvt",0,"nvt"]
[null,null,{"$f":"IF('Algemene gegevens'!C25=\"\",\"\",'Algemene gegevens'!C25)","v":""},{"$f":"IF('Algemene gegevens'!D25=\"\",\"\",'Algemene gegevens'!D25)","v":""},{"$f":"IF('Algemene gegevens'!E25=\"\",\"\",'Algemene gegevens'!E25)","v":""},{"$f":"IF('Algemene gegevens'!F25=\"\",\"\",'Algemene gegevens'!F25)","v":""},{"$f":"D!$I27","v":0},{"$f":"D!$O27","v":0},0,"nvt",30,"nvt",0,"nvt",0,"nvt",0,"nvt",0,"nvt",0,"nvt",0,"nvt"]
[null,null,{"$f":"IF('Algemene gegevens'!C26=\"\",\"\",'Algemene gegevens'!C26)","v":""},{"$f":"IF('Algemene gegevens'!D26=\"\",\"\",'Algemene gegevens'!D26)","v":""},{"$f":"IF('Algemene gegevens'!E26=\"\",\"\",'Algemene gegevens'!E26)","v":""},{"$f":"IF('Algemene gegevens'!F26=\"\",\"\",'Algemene gegevens'!F26)","v":""},{"$f":"D!$I28","v":0},{"$f":"D!$O28","v":0},0,"nvt",0,"nvt",0,"nvt",0,"nvt",0,"nvt",0,"nvt",0,"nvt",0,"nvt"]
[null,null,{"$f":"IF('Algemene gegevens'!C27=\"\",\"\",'Algemene gegevens'!C27)","v":""},{"$f":"IF('Algemene gegevens'!D27=\"\",\"\",'Algemene gegevens'!D27)","v":""},{"$f":"IF('Algemene gegevens'!E27=\"\",\"\",'Algemene gegevens'!E27)","v":""},{"$f":"IF('Algemene gegevens'!F27=\"\",\"\",'Algemene gegevens'!F27)","v":""},{"$f":"D!$I29","v":0},{"$f":"D!$O29","v":0},0,"nvt",0,"nvt",0,"nvt",0,"nvt",0,"nvt",0,"nvt",0,"nvt",0,"nvt"]
[null,null,{"$f":"IF('Algemene gegevens'!C28=\"\",\"\",'Algemene gegevens'!C28)","v":""},{"$f":"IF('Algemene gegevens'!D28=\"\",\"\",'Algemene gegevens'!D28)","v":""},{"$f":"IF('Algemene gegevens'!E28=\"\",\"\",'Algemene gegevens'!E28)","v":""},{"$f":"IF('Algemene gegevens'!F28=\"\",\"\",'Algemene gegevens'!F28)","v":""},{"$f":"D!$I30","v":0},{"$f":"D!$O30","v":0},0,"nvt",0,"nvt",0,"nvt",0,"nvt",0,"nvt",0,"nvt",0,"nvt",0,"nvt"]
[null,null,{"$f":"IF('Algemene gegevens'!C29=\"\",\"\",'Algemene gegevens'!C29)","v":""},{"$f":"IF('Algemene gegevens'!D29=\"\",\"\",'Algemene gegevens'!D29)","v":""},{"$f":"IF('Algemene gegevens'!E29=\"\",\"\",'Algemene gegevens'!E29)","v":""},{"$f":"IF('Algemene gegevens'!F29=\"\",\"\",'Algemene gegevens'!F29)","v":""},{"$f":"D!$I31","v":0},{"$f":"D!$O31","v":0},0,"nvt",0,"nvt",0,"nvt",0,"nvt",0,"nvt",0,"nvt",0,"nvt",0,"nvt"]
[null,null,{"$f":"IF('Algemene gegevens'!C30=\"\",\"\",'Algemene gegevens'!C30)","v":""},{"$f":"IF('Algemene gegevens'!D30=\"\",\"\",'Algemene gegevens'!D30)","v":""},{"$f":"IF('Algemene gegevens'!E30=\"\",\"\",'Algemene gegevens'!E30)","v":""},{"$f":"IF('Algemene gegevens'!F30=\"\",\"\",'Algemene gegevens'!F30)","v":""},{"$f":"D!$I32","v":0},{"$f":"D!$O32","v":0},0,"nvt",0,"nvt",0,"nvt",0,"nvt",0,"nvt",0,"nvt",0,"nvt",0,"nvt"]
[null,null,{"$f":"IF('Algemene gegevens'!C31=\"\",\"\",'Algemene gegevens'!C31)","v":""},{"$f":"IF('Algemene gegevens'!D31=\"\",\"\",'Algemene gegevens'!D31)","v":""},{"$f":"IF('Algemene gegevens'!E31=\"\",\"\",'Algemene gegevens'!E31)","v":""},{"$f":"IF('Algemene gegevens'!F31=\"\",\"\",'Algemene gegevens'!F31)","v":""},{"$f":"D!$I33","v":0},{"$f":"D!$O33","v":0},0,"nvt",0,"nvt",0,"nvt",0,"nvt",0,"nvt",0,"nvt",0,"nvt",0,"nvt"]
[null,null,{"$f":"IF('Algemene gegevens'!C32=\"\",\"\",'Algemene gegevens'!C32)","v":""},{"$f":"IF('Algemene gegevens'!D32=\"\",\"\",'Algemene gegevens'!D32)","v":""},{"$f":"IF('Algemene gegevens'!E32=\"\",\"\",'Algemene gegevens'!E32)","v":""},{"$f":"IF('Algemene gegevens'!F32=\"\",\"\",'Algemene gegevens'!F32)","v":""},{"$f":"D!$I34","v":0},{"$f":"D!$O34","v":0},0,"nvt",0,"nvt",0,"nvt",0,"nvt",0,"nvt",0,"nvt",0,"nvt",0,"nvt"]
[null,null,null,null,null,"totalen",{"$f":"SUM(G18:G38)","v":0},{"$f":"SUM(H18:H38)","v":0},{"$f":"SUM(I18:I38)","v":328},"nvt",{"$f":"SUM(K18:K38)","v":310},{"$f":"IF($H39=0,\"nvt\",K39/$H39*100)","v":"nvt"},{"$f":"SUM(M18:M38)","v":0},"nvt",{"$f":"SUM(O18:O38)","v":85},{"$f":"IF($H39=0,\"nvt\",O39/$H39*100)","v":"nvt"},{"$f":"SUM(Q18:Q38)","v":0},"nvt",{"$f":"SUM(S18:S38)","v":85},{"$f":"IF($H39=0,\"nvt\",S39/$H39*100)","v":"nvt"},{"$f":"SUM(U18:U38)","v":0},"nvt",{"$f":"SUM(W18:W38)","v":85},{"$f":"IF($H39=0,\"nvt\",W39/$H39*100)","v":"nvt"}]

{"sheet":"Afpuntlijsten","index":7,"n_rows":101,"n_cols":9,"rows_kept":101,"cut":false,"hidden":false,"merged":[]}
[]
[null,"AFPUNTLIJSTEN "]
[]
[null,"OPLEVERING",null,null,null,"A","B","C","D"]
[]
[null,null,"Instellingen en metingen"]
[null,null,"instellen van de ventilatorstanden",null,null,null,"x","x","x"]
[null,null,"instellen klokregeling, aanwezigheidssturing,…",null,null,null,"(x)","(x)","(x)"]
[null,null,"instellen en meten van de toevoerdebieten",null,null,null,"x",null,"x"]
[null,null,"instellen en meten van de afvoerdebieten",null,null,null,null,"x","x"]
[null,null,"lekdebietmeting toevoerkanalen",null,null,null,"(x)",null,"(x)"]
[null,null,"lekdebietsmeting afvoerkanalen",null,null,"(x)","(x)","(x)","(x)"]
[null,null,"akoestische prestaties",null,null,"(x)","(x)","(x)","(x)"]
[]
[null,null,"controle op conformiteit met het bestek"]
[null,null,"producten",null,null,"x","x","x","x"]
[null,null,"montage",null,null,"x","x","x","x"]
[null,null,"prestaties: zie hoger"]
[]
[null,null,"controle op de goede werking"]
[null,null,"regeling RTO",null,null,"x",null,"x"]
[null,null,"regeling RAO",null,null,"x","x"]
[null,null,"regeling ventilator",null,null,null,"x","x","x"]
[null,null,"werking vorstbeveiliging",null,null,null,null,null,"(x)"]
[null,null,"werking zomer-bypass",null,null,null,null,null,"(x)"]
[null,null,"werking naverwarming",null,null,null,null,null,"(x)"]
[null,null,"werking automatische regelingen",null,null,"(x)","(x)","(x)","(x)"]
[null,null,"klokregeling, aanwezigheid, CO2, vocht"]
[]
[null,null,"instructie van de gebruiker"]
[null,null,"toelichten globale werking",null,null,"x","x","x","x"]
[null,null,"regelmogelijkheden",null,null,"x","x","x","x"]
[null,null,"toelichten onderhoudsplan",null,null,"x","x","x","x"]
[null,null,"overhandigen van:"]
[null,null,"gebruikershandleiding met storingskaart",null,null,"x","x","x","x"]
[null,null,"gebruikerskaart (1 blad)",null,null,"x","x","x","x"]
[null,null,"garantiekaart",null,null,"x","x","x","x"]
[]
[null,null,"informatie voor de verslaggever/gebruiker"]
[null,null,"grond plan met TO, AO, DO, kanalennet",null,null,"x","x","x","x"]
[null,null,"kanaalberekening",null,null,null,"x","x","x"]
[null,null,"overzicht van de gebruikte producten",null,null,"x","x","x","x"]
[null,null,"technische documentatie van de producten",null,null,"x","x","x","x"]
[null,null,"rapporteringsblad meetresultaten, inclusief stavingsstukken",null,null,"x","x","x","x"]
[null,null,null,null,"indien van toepassing","(x)"]
[]
[]
[null,"ONDERHOUD",null,null,"frequentie","A","B","C","D"]
[]
[null,null,"door de gebruiker"]
[null,null,"reinig toevoer- of afvoeropeningen",null,null,"x","x","x","x"]
[null,null,"reinig of vervang de filters in de ventilatieunit",null,"1 - 3 m",null,"x",null,"x"]
[null,null,"controle condensafvoer",null,null,null,null,null,"x"]
[]
[null,null,"Reinig of vervang de filters in de dampkap",null,"voorschrift","x","x","x","x"]
[null,null,"door de installateur"]
[null,null,"reiniging warmteterugwinblok",null,"1 - 3 j",null,null,null,"x"]
[null,null,"reiniging ventilatoren",null,"1 - 3 j",null,"x","x","x"]
[null,null,"inspectie en eventueel reiniging van kanalen",null,"1 - 3 j",null,"x","x","x"]
[null,null,"controle op de goede werking: zie oplevering",null,"1 - 3 j","x","x","x","x"]
[null,null,"instellingen en metingen: zie oplevering behalve kanaallekken",null,"3 j","x","x","x","x"]
[]
[]
[null,"GEBRUIK",null,null,null,"A","B","C","D"]
[]
[null,null,"Algemene toelichting",null,null,"x","x","x","x"]
[]
[null,null,"RTO",null,null,"x",null,"x"]
[]
[]
[]
[null,null,"RAO",null,null,"x","x"]
[]
[]
[]
[null,null,"Ventilator",null,null,null,"x","x","x"]
[null,null,"2 standen"]
[null,null,"3 of meer standen"]
[]
[]
[]
[]
[null,null,"zomer by pass",null,null,null,null,null,"x"]
[null,null,"klep"]
[null,null,"wisselen blok"]
[]
[null,null,"dampkap  ",null,null,"?","?","?","?"]
[null,null,"dampkap met ventilator"]
[]
[]
[null,null,"motorloze dampkap"]
[]
[]
[null,null,"recirculatie dampkap"]
[]
[]
[null,null,"vensterverluchting"]
[]
[]
[]
[null,null,"intensieve nachtkoeling"]

{"sheet":"Data","index":8,"n_rows":82,"n_cols":9,"rows_kept":82,"cut":false,"hidden":false,"merged":[]}
[]
["Dit tabblad bevat gegevens ter ondersteuning van de programmatie die niet gewijzigd mogen worden!!"]
[]
["ventilatiesysteem"]
["A: natuurlijke toevoer, natuurlijke afvoer ","A",1]
["B: mechanische toevoer, vrije afvoer","B",2]
["C: vrije toevoer, mechanische afvoer","C",3]
["D: mechanische toevoer, mechanische afvoer ","D",4]
[null,"algemeen","min","beperking"]
["type","Talg","Tmin","Tbeperk","Dmin","Luchttype"]
["Slaapkamer",3.6,25,72,25,1,null,1,"Toevoer"]
["Speelkamer",3.6,25,72,25,1,null,2,"Afvoer"]
["Studeerkamer",3.6,25,72,25,1,null,3,"Geen eis"]
["Woonkamer",3.6,75,150,25,1]
["Andere natte ruimte",3.6,50,75,25,2]
["Badkamer",3.6,50,75,25,2]
["Wasplaats",3.6,50,75,25,2]
["Droogplaats",3.6,50,75,25,2]
["Douche",3.6,50,75,25,2]
["Gesloten keuken",3.6,50,75,50,2]
["Open keuken",3.6,75,75,50,2]
["WC",null,25,25,25,2]
["Gang",0,0,0,0,3]
["Trapzaal",0,0,0,0,3]
["Hall",0,0,0,0,3]
["Bergruimte",0,0,0,0,3]
["Kelder",0,0,0,0,3]
["Zolder",0,0,0,0,3]
["Garage",0,0,0,0,3]
["Speciale ruimte",0,0,0,0,3]
["Ander type",0,0,0,0,3]
[]
["zelfregelbaarheidsklassen toevoer","zelfregelbaarheidsfactor"]
["P0",0.2]
["P1",0.18]
["P2",0.14000000000000001]
["P3",0.08]
["P4",0.02]
[]
["aanvink"]
["ja"]
["nee"]
[]
["ventilatoren"]
["geen opgave"]
["wisselstroomventilator (AC)"]
["gelijkstroomventilator (DC)"]
[]
["bypass"]
["zonder zomerbypass"]
["onvolledige zomerbypass"]
["volledige zomerbypass"]
[]
["rendement",0]
[null,{"$f":"B54+5","v":5}]
[null,{"$f":"B55+5","v":10}]
[null,15]
[null,20]
[null,25]
[null,30]
[null,35]
[null,40]
[null,45]
[null,50]
[null,55]
[null,60]
[null,65]
[null,70]
[null,75]
[null,80]
[null,85]
[null,90]
[null,95]
[null,100]
[]
["Balansventilatie: grens overmaat","%"]
["Low",-5]
["High",10]
[]
["toevoer"]
["Rooster","roosterhoogte","roosterlengte","Qv","geluidsniveauverschil"]
["Rooster",50,3050,75.599999999999994,25.9]